{"text_format":"1","workbook":"xlsx","n_sheets":7,"sheets":["表紙","12","34男","34女","56男","56女","syozoku"],"not_rendered":{"charts":0,"images":0,"macros":1,"external_links":0,"defined_names":0,"comments":0,"pivot_tables":0},"unopened":[],"bounds":{"document_bytes":16777216,"sheet_cells":100000,"rows_first":2000,"rows_last":500,"rows_between":2000,"halvings":0,"cell_chars":16384,"cell_head_chars":4096},"cells_cut":0,"cells_raw":0,"read":"whole","date_system":"1900"}

{"sheet":"表紙","index":0,"n_rows":26,"n_cols":9,"rows_kept":26,"cut":false,"hidden":false,"merged":[]}
["令和4","年度群馬県小学生駅伝大会　兼　小学生マラソン大会　申込書"]
[]
["クラブ名",null,"←プルダウンリストより選択",null,null,null,"クラブコード",{"$f":"IF($B$3=\"\",\"\",VLOOKUP($B$3,syozoku!$C:$G,4,FALSE))","v":""}]
["申込責任者",null,"←責任者のお名前を入力",null,null,null,"ゼッケン初期値",{"$f":"IF($B$3=\"\",\"\",VLOOKUP($B$3,syozoku!$C:$G,4,FALSE)*100)","v":""}]
["責任者連絡先",null,"←責任者の電話番号を入力",null,null,null,"クラブ略称",{"$f":"IF($B$3=\"\",\"\",VLOOKUP($B$3,syozoku!$C:$G,2,FALSE))","v":""}]
["責任者メール",null,"←責任者のメールアドレスを入力",null,null,null,"DB初期値",{"$f":"IF($B$3=\"\",\"\",VLOOKUP($B$3,syozoku!$C:$G,4,FALSE)*10000)","v":""}]
[null,"審判員名前","希望係担当","陸上経験"]
["審判員１",null,null,null,null,null,"○"]
["審判員２",null,null,null,null,null,"中学年補員レース","８００ｍ",{"$f":"IF(H9=\"\",\"\",\"R\" & VLOOKUP($H$9,$G$13:H26,2,FALSE) & \"0\")","v":"R0060"}]
["審判員３",null,null,null,null,null,"高学年補員レース","１０００ｍ",{"$f":"IF(H10=\"\",\"\",\"R\" & VLOOKUP($H$10,$G$13:H27,2,FALSE) & \"0\")","v":"R0070"}]
["審判員４"]
["審判員５"]
[null,"↑審判員お名前を入力","↑希望する係があれば入力","↑陸上経験ありならば○を入力",null,null,"５０ｍ",421]
[null,null,null,null,null,null,"６０ｍ","001"]
[null,null,null,null,null,null,"１００ｍ","002"]
[null,null,null,null,null,null,"ジグザグ５０ｍ",422]
[null,null,null,null,null,null,"２００ｍ","003"]
[null,null,null,null,null,null,"３００ｍ","004"]
[null,null,null,null,null,null,"４００ｍ","005"]
[null,null,null,null,null,null,"５００ｍ","050"]
{"$rows_left_out":7}
{"sheet":"12","index":1,"n_rows":52,"n_cols":18,"rows_kept":52,"cut":false,"hidden":false,"merged":[]}
[null,{"$f":"表紙!A1","v":"令和4"},"年度　小学生マラソン大会　入力欄",null,null,null,null,null,null,null,"マスター系CSV作成"]
["No.","学年","性別","名前","フリガナ（半角カナ）",null,"クラブコード",{"$f":"表紙!H3","v":""},null,null,"DB","N1","N2","SX","KC","MC","ZK","S1"]
[1,null,null,null,null,null,"ゼッケン初期値",{"$f":"表紙!H4","v":""},null,null,{"$f":"IF($D3=\"\",\"\",B3*100000000+$H$5+$H$6+$A3)","v":""},{"$f":"IF($D3=\"\",\"\",CONCATENATE(D3,\"(\",B3,\")\",))","v":""},{"$f":"IF($D3=\"\",\"\",E3)","v":""},{"$f":"IF($D3=\"\",\"\",IF(C3=\"男\",1,2))","v":""},{"$f":"IF($D3=\"\",\"\",10)","v":""},{"$f":"IF($D3=\"\",\"\",$H$2)","v":""},{"$f":"IF($D3=\"\",\"\",K3)","v":""},{"$f":"IF($D3=\"\",\"\",CONCATENATE(\"R0500\",B3))","v":""}]
[2,null,null,null,null,null,"クラブ略称",{"$f":"表紙!H5","v":""},null,null,{"$f":"IF($D4=\"\",\"\",B4*100000000+$H$5+$H$6+$A4)","v":""},{"$f":"IF($D4=\"\",\"\",CONCATENATE(D4,\"(\",B4,\")\",))","v":""},{"$f":"IF($D4=\"\",\"\",E4)","v":""},{"$f":"IF($D4=\"\",\"\",IF(C4=\"男\",1,2))","v":""},{"$f":"IF($D4=\"\",\"\",10)","v":""},{"$f":"IF($D4=\"\",\"\",$H$2)","v":""},{"$f":"IF($D4=\"\",\"\",K4)","v":""},{"$f":"IF($D4=\"\",\"\",CONCATENATE(\"R0500\",B4))","v":""}]
[3,null,null,null,null,null,"DB初期値",{"$f":"表紙!H6","v":""},null,null,"","","","","","","",""]
[4,null,null,null,null,null,"種目固有数",100,null,null,"","","","","","","",""]
[5,null,null,null,null,null,"学年",1,null,null,"","","","","","","",""]
[6,null,null,null,null,null,null,2,null,null,"","","","","","","",""]
[7,null,null,null,null,null,null,null,null,null,"","","","","","","",""]
[8,null,null,null,null,null,"性別","男",null,null,"","","","","","","",""]
[9,null,null,null,null,null,null,"女",null,null,"","","","","","","",""]
[10,null,null,null,null,null,null,null,null,null,"","","","","","","",""]
[11,null,null,null,null,null,null,null,null,null,"","","","","","","",""]
[12,null,null,null,null,null,null,null,null,null,"","","","","","","",""]
[13,null,null,null,null,null,null,null,null,null,"","","","","","","",""]
[14,null,null,null,null,null,null,null,null,null,"","","","","","","",""]
[15,null,null,null,null,null,null,null,null,null,"","","","","","","",""]
[16,null,null,null,null,null,null,null,null,null,"","","","","","","",""]
[17,null,null,null,null,null,null,null,null,null,"","","","","","","",""]
[18,null,null,null,null,null,null,null,null,null,"","","","","","","",""]
{"$rows_left_out":33}
{"sheet":"34男","index":2,"n_rows":32,"n_cols":31,"rows_kept":32,"cut":false,"hidden":false,"merged":[]}
[null,{"$f":"表紙!A1","v":"令和4"},"年度群馬県小学生駅伝競争大会　３４年男子　入力欄",null,null,null,null,null,null,null,"マスター系CSV作成",null,null,null,null,null,null,null,null,"メンバー系CSV作成",null,null,null,null,null,null,"チーム系CSV作成"]
["No.","学年","名前","フリガナ（半角カナ）","担当",null,"クラブコード",{"$f":"表紙!H3","v":""},null,null,"DB","N1","N2","SX","KC","MC","ZK","s1",null,"TM","DB","N1","N2","KC","MC",null,"ZK","N1","N2","N3","OP"]
[1,null,null,null,"Aチーム1区",null,"ゼッケン初期値",{"$f":"表紙!H4","v":""},null,null,{"$f":"IF($D3=\"\",\"\",B3*100000000+$H$5+$H$6+$A3)","v":""},{"$f":"IF($C3=\"\",\"\",CONCATENATE(C3,\"(\",B3,\")\",))","v":""},{"$f":"IF($C3=\"\",\"\",D3)","v":""},{"$f":"IF($C3=\"\",\"\",1)","v":""},{"$f":"IF($C3=\"\",\"\",10)","v":""},{"$f":"IF($C3=\"\",\"\",$H$2)","v":""},{"$f":"IF($C3=\"\",\"\",K3)","v":""},{"$f":"IF(C3=\"\",\"\",CONCATENATE(\"R17208\"))","v":""},0,{"$f":"IF(K3=\"\",\"\",$H$2*10+S3)","v":""},{"$f":"IF(K3=\"\",\"\",K3)","v":""},{"$f":"IF(U3=\"\",\"\",L3)","v":""},{"$f":"IF(V3=\"\",\"\",M3)","v":""},{"$f":"IF(W3=\"\",\"\",O3)","v":""},{"$f":"IF(X3=\"\",\"\",P3)","v":""},"A",{"$f":"IF(T3=\"\",\"\",T3)","v":""},{"$f":"IF($AA$3=\"\",\"\",CONCATENATE($H$4,\" \",$Z3))","v":""},{"$f":"IF($AA$3=\"\",\"\",表紙!$B$3)","v":""},{"$f":"IF($AA$3=\"\",\"\",CONCATENATE(\"指導者\",\" \",表紙!$B$4))","v":""},{"$f":"IF(AA3=\"\",\"\",0)","v":""}]
[2,null,null,null,"Aチーム2区",null,"クラブ略称",{"$f":"表紙!H5","v":""},null,null,{"$f":"IF($D4=\"\",\"\",B4*100000000+$H$5+$H$6+$A4)","v":""},{"$f":"IF($C4=\"\",\"\",CONCATENATE(C4,\"(\",B4,\")\",))","v":""},{"$f":"IF($C4=\"\",\"\",D4)","v":""},{"$f":"IF($C4=\"\",\"\",1)","v":""},{"$f":"IF($C4=\"\",\"\",10)","v":""},{"$f":"IF($C4=\"\",\"\",$H$2)","v":""},{"$f":"IF($C4=\"\",\"\",K4)","v":""},{"$f":"IF(C4=\"\",\"\",CONCATENATE(\"R17208\"))","v":""},0,{"$f":"IF(K4=\"\",\"\",$H$2*10+S4)","v":""},{"$f":"IF(K4=\"\",\"\",K4)","v":""},{"$f":"IF(U4=\"\",\"\",L4)","v":""},"",{"$f":"IF(W4=\"\",\"\",O4)","v":""},""]
[3,null,null,null,"Aチーム3区",null,"DB初期値",{"$f":"表紙!H6","v":""},null,null,"","","","","","","","",0,"","",{"$f":"IF(U5=\"\",\"\",L5)","v":""},"",{"$f":"IF(W5=\"\",\"\",O5)","v":""},""]
[4,null,null,null,"Aチーム4区",null,"種目固有数",200,null,null,"","","","","","","","",0,"","",{"$f":"IF(U6=\"\",\"\",L6)","v":""},"",{"$f":"IF(W6=\"\",\"\",O6)","v":""},""]
[5,null,null,null,"Aチーム5区",null,"学年",3,null,null,"","","","","","","","",0,"","",{"$f":"IF(U7=\"\",\"\",L7)","v":""},"",{"$f":"IF(W7=\"\",\"\",O7)","v":""},""]
[6,null,null,null,"Bチーム1区",null,null,4,null,null,"","","","","","","","",1,"","",{"$f":"IF(U8=\"\",\"\",L8)","v":""},"",{"$f":"IF(W8=\"\",\"\",O8)","v":""},"","B",{"$f":"IF(T8=\"\",\"\",T8)","v":""},{"$f":"IF($AA$3=\"\",\"\",CONCATENATE($H$4,\" \",$Z8))","v":""},{"$f":"IF($AA$3=\"\",\"\",表紙!$B$3)","v":""},{"$f":"IF($AA$3=\"\",\"\",CONCATENATE(\"指導者\",\" \",表紙!$B$4))","v":""},{"$f":"IF(AA8=\"\",\"\",0)","v":""}]
[7,null,null,null,"Bチーム2区",null,null,null,null,null,"","",{"$f":"IF($C9=\"\",\"\",D9)","v":""},{"$f":"IF($C9=\"\",\"\",1)","v":""},{"$f":"IF($C9=\"\",\"\",10)","v":""},{"$f":"IF($C9=\"\",\"\",$H$2)","v":""},{"$f":"IF($C9=\"\",\"\",K9)","v":""},"",1,"","",{"$f":"IF(U9=\"\",\"\",L9)","v":""},"",{"$f":"IF(W9=\"\",\"\",O9)","v":""},""]
[8,null,null,null,"Bチーム3区",null,"性別","男",null,null,"","",{"$f":"IF($C10=\"\",\"\",D10)","v":""},"","","",{"$f":"IF($C10=\"\",\"\",K10)","v":""},"",1,"","",{"$f":"IF(U10=\"\",\"\",L10)","v":""},"",{"$f":"IF(W10=\"\",\"\",O10)","v":""},""]
[9,null,null,null,"Bチーム4区",null,null,"女",null,null,"","","","","","","","",1,"","",{"$f":"IF(U11=\"\",\"\",L11)","v":""},"",{"$f":"IF(W11=\"\",\"\",O11)","v":""},""]
[10,null,null,null,"Bチーム5区",null,null,null,null,null,"","","","","","","","",1,"","",{"$f":"IF(U12=\"\",\"\",L12)","v":""},"",{"$f":"IF(W12=\"\",\"\",O12)","v":""},""]
[11,null,null,null,"Cチーム1区",null,null,null,null,null,"","","","","","","","",2,"","",{"$f":"IF(U13=\"\",\"\",L13)","v":""},"",{"$f":"IF(W13=\"\",\"\",O13)","v":""},"","C",{"$f":"IF(T13=\"\",\"\",T13)","v":""},{"$f":"IF($AA$3=\"\",\"\",CONCATENATE($H$4,\" \",$Z13))","v":""},{"$f":"IF($AA$3=\"\",\"\",表紙!$B$3)","v":""},{"$f":"IF($AA$3=\"\",\"\",CONCATENATE(\"指導者\",\" \",表紙!$B$4))","v":""},{"$f":"IF(AA13=\"\",\"\",0)","v":""}]
[12,null,null,null,"Cチーム2区",null,null,null,null,null,"","","","","","","","",2,"","",{"$f":"IF(U14=\"\",\"\",L14)","v":""},"",{"$f":"IF(W14=\"\",\"\",O14)","v":""},""]
[13,null,null,null,"Cチーム3区",null,null,null,null,null,"","",{"$f":"IF($C15=\"\",\"\",D15)","v":""},{"$f":"IF($C15=\"\",\"\",1)","v":""},{"$f":"IF($C15=\"\",\"\",10)","v":""},{"$f":"IF($C15=\"\",\"\",$H$2)","v":""},{"$f":"IF($C15=\"\",\"\",K15)","v":""},"",2,"","",{"$f":"IF(U15=\"\",\"\",L15)","v":""},"",{"$f":"IF(W15=\"\",\"\",O15)","v":""},""]
[14,null,null,null,"Cチーム4区",null,null,null,null,null,"","",{"$f":"IF($C16=\"\",\"\",D16)","v":""},"","","",{"$f":"IF($C16=\"\",\"\",K16)","v":""},"",2,"","",{"$f":"IF(U16=\"\",\"\",L16)","v":""},"",{"$f":"IF(W16=\"\",\"\",O16)","v":""},""]
[15,null,null,null,"Cチーム5区",null,null,null,null,null,"","","","","","","","",2,"","",{"$f":"IF(U17=\"\",\"\",L17)","v":""},"",{"$f":"IF(W17=\"\",\"\",O17)","v":""},""]
[16,null,null,null,"Dチーム1区",null,null,null,null,null,"","","","","","","","",3,"","",{"$f":"IF(U18=\"\",\"\",L18)","v":""},"",{"$f":"IF(W18=\"\",\"\",O18)","v":""},"","D",{"$f":"IF(T18=\"\",\"\",T18)","v":""},{"$f":"IF($AA$3=\"\",\"\",CONCATENATE($H$4,\" \",$Z18))","v":""},{"$f":"IF($AA$3=\"\",\"\",表紙!$B$3)","v":""},{"$f":"IF($AA$3=\"\",\"\",CONCATENATE(\"指導者\",\" \",表紙!$B$4))","v":""},{"$f":"IF(AA18=\"\",\"\",0)","v":""}]
[17,null,null,null,"Dチーム2区",null,null,null,null,null,"","","","","","","","",3,"","",{"$f":"IF(U19=\"\",\"\",L19)","v":""},"",{"$f":"IF(W19=\"\",\"\",O19)","v":""},""]
[18,null,null,null,"Dチーム3区",null,null,null,null,null,"","","","","","","","",3,"","",{"$f":"IF(U20=\"\",\"\",L20)","v":""},"",{"$f":"IF(W20=\"\",\"\",O20)","v":""},""]
{"$rows_left_out":13}
{"sheet":"34女","index":3,"n_rows":32,"n_cols":31,"rows_kept":32,"cut":false,"hidden":false,"merged":[]}
[null,{"$f":"表紙!A1","v":"令和4"},"年度群馬県小学生駅伝競争大会　３４年女子　入力欄",null,null,null,null,null,null,null,"マスター系CSV作成",null,null,null,null,null,null,null,null,"メンバー系CSV作成",null,null,null,null,null,null,"チーム系CSV作成"]
["No.","学年","名前","フリガナ（半角カナ）","担当",null,"クラブコード",{"$f":"表紙!H3","v":""},null,null,"DB","N1","N2","SX","KC","MC","ZK","s1",null,"TM","DB","N1","N2","KC","MC",null,"ZK","N1","N2","N3","OP"]
[1,null,null,null,"Aチーム1区",null,"ゼッケン初期値",{"$f":"表紙!H4","v":""},null,null,{"$f":"IF($D3=\"\",\"\",B3*100000000+$H$5+$H$6+$A3)","v":""},{"$f":"IF($C3=\"\",\"\",CONCATENATE(C3,\"(\",B3,\")\",))","v":""},{"$f":"IF($C3=\"\",\"\",D3)","v":""},{"$f":"IF($C3=\"\",\"\",2)","v":""},{"$f":"IF($C3=\"\",\"\",10)","v":""},{"$f":"IF($C3=\"\",\"\",$H$2)","v":""},{"$f":"IF($C3=\"\",\"\",K3)","v":""},{"$f":"IF(C3=\"\",\"\",CONCATENATE(\"R17208\"))","v":""},0,{"$f":"IF(K3=\"\",\"\",$H$2*10+S3)","v":""},{"$f":"IF(K3=\"\",\"\",K3)","v":""},{"$f":"IF(U3=\"\",\"\",L3)","v":""},{"$f":"IF(V3=\"\",\"\",M3)","v":""},{"$f":"IF(W3=\"\",\"\",O3)","v":""},{"$f":"IF(X3=\"\",\"\",P3)","v":""},"A",{"$f":"IF(T3=\"\",\"\",T3)","v":""},{"$f":"IF($AA$3=\"\",\"\",CONCATENATE($H$4,\" \",$Z3))","v":""},{"$f":"IF($AA$3=\"\",\"\",表紙!$B$3)","v":""},{"$f":"IF($AA$3=\"\",\"\",CONCATENATE(\"指導者\",\" \",表紙!$B$4))","v":""},{"$f":"IF(AA3=\"\",\"\",0)","v":""}]
[2,null,null,null,"Aチーム2区",null,"クラブ略称",{"$f":"表紙!H5","v":""},null,null,{"$f":"IF($D4=\"\",\"\",B4*100000000+$H$5+$H$6+$A4)","v":""},{"$f":"IF($C4=\"\",\"\",CONCATENATE(C4,\"(\",B4,\")\",))","v":""},{"$f":"IF($C4=\"\",\"\",D4)","v":""},{"$f":"IF($C4=\"\",\"\",2)","v":""},{"$f":"IF($C4=\"\",\"\",10)","v":""},{"$f":"IF($C4=\"\",\"\",$H$2)","v":""},{"$f":"IF($C4=\"\",\"\",K4)","v":""},"",0,{"$f":"IF(K4=\"\",\"\",$H$2*10+S4)","v":""},{"$f":"IF(K4=\"\",\"\",K4)","v":""},{"$f":"IF(U4=\"\",\"\",L4)","v":""},"",{"$f":"IF(W4=\"\",\"\",O4)","v":""},""]
[3,null,null,null,"Aチーム3区",null,"DB初期値",{"$f":"表紙!H6","v":""},null,null,"","","","","","","","",0,"","","","","",""]
[4,null,null,null,"Aチーム4区",null,"種目固有数",300,null,null,"","","","","","","","",0,"","","","","",""]
[5,null,null,null,"Aチーム5区",null,"学年",3,null,null,"","","","","","","","",0,"","","","","",""]
[6,null,null,null,"Bチーム1区",null,null,4,null,null,"","","","","","","","",1,"","","","","","","B",{"$f":"IF(T8=\"\",\"\",T8)","v":""},{"$f":"IF($AA$3=\"\",\"\",CONCATENATE($H$4,\" \",$Z8))","v":""},{"$f":"IF($AA$3=\"\",\"\",表紙!$B$3)","v":""},{"$f":"IF($AA$3=\"\",\"\",CONCATENATE(\"指導者\",\" \",表紙!$B$4))","v":""},{"$f":"IF(AA8=\"\",\"\",0)","v":""}]
[7,null,null,null,"Bチーム2区",null,null,null,null,null,"","",{"$f":"IF($C9=\"\",\"\",D9)","v":""},"",{"$f":"IF($C9=\"\",\"\",10)","v":""},{"$f":"IF($C9=\"\",\"\",$H$2)","v":""},{"$f":"IF($C9=\"\",\"\",K9)","v":""},"",1,"","","","","",""]
[8,null,null,null,"Bチーム3区",null,"性別","男",null,null,"","",{"$f":"IF($C10=\"\",\"\",D10)","v":""},"","","",{"$f":"IF($C10=\"\",\"\",K10)","v":""},"",1,"","","","","",""]
[9,null,null,null,"Bチーム4区",null,null,"女",null,null,"","","","","","","","",1,"","","","","",""]
[10,null,null,null,"Bチーム5区",null,null,null,null,null,"","","","","","","","",1,"","","","","",""]
[11,null,null,null,"Cチーム1区",null,null,null,null,null,"","","","","","","","",2,"","","","","","","C",{"$f":"IF(T13=\"\",\"\",T13)","v":""},{"$f":"IF($AA$3=\"\",\"\",CONCATENATE($H$4,\" \",$Z13))","v":""},{"$f":"IF($AA$3=\"\",\"\",表紙!$B$3)","v":""},{"$f":"IF($AA$3=\"\",\"\",CONCATENATE(\"指導者\",\" \",表紙!$B$4))","v":""},{"$f":"IF(AA13=\"\",\"\",0)","v":""}]
[12,null,null,null,"Cチーム2区",null,null,null,null,null,"","","","","","","","",2,"","","","","",""]
[13,null,null,null,"Cチーム3区",null,null,null,null,null,"","",{"$f":"IF($C15=\"\",\"\",D15)","v":""},"",{"$f":"IF($C15=\"\",\"\",10)","v":""},{"$f":"IF($C15=\"\",\"\",$H$2)","v":""},{"$f":"IF($C15=\"\",\"\",K15)","v":""},"",2,"","","","","",""]
[14,null,null,null,"Cチーム4区",null,null,null,null,null,"","",{"$f":"IF($C16=\"\",\"\",D16)","v":""},"","","",{"$f":"IF($C16=\"\",\"\",K16)","v":""},"",2,"","","","","",""]
[15,null,null,null,"Cチーム5区",null,null,null,null,null,"","","","","","","","",2,"","","","","",""]
[16,null,null,null,"Dチーム1区",null,null,null,null,null,"","","","","","","","",3,"","","","","","","D",{"$f":"IF(T18=\"\",\"\",T18)","v":""},{"$f":"IF($AA$3=\"\",\"\",CONCATENATE($H$4,\" \",$Z18))","v":""},{"$f":"IF($AA$3=\"\",\"\",表紙!$B$3)","v":""},{"$f":"IF($AA$3=\"\",\"\",CONCATENATE(\"指導者\",\" \",表紙!$B$4))","v":""},{"$f":"IF(AA18=\"\",\"\",0)","v":""}]
[17,null,null,null,"Dチーム2区",null,null,null,null,null,"","","","","","","","",3,"","","","","",""]
[18,null,null,null,"Dチーム3区",null,null,null,null,null,"","","","","","","","",3,"","",{"$f":"IF(U20=\"\",\"\",L20)","v":""},"",{"$f":"IF(W20=\"\",\"\",O20)","v":""},""]
{"$rows_left_out":13}
{"sheet":"56男","index":4,"n_rows":32,"n_cols":31,"rows_kept":32,"cut":false,"hidden":false,"merged":[]}
[null,{"$f":"表紙!A1","v":"令和4"},"年度群馬県小学生駅伝競争大会　５６年男子　入力欄",null,null,null,null,null,null,null,"マスター系CSV作成",null,null,null,null,null,null,null,null,"メンバー系CSV作成",null,null,null,null,null,null,"チーム系CSV作成"]
["No.","学年","名前","フリガナ（半角カナ）","担当",null,"クラブコード",{"$f":"表紙!H3","v":""},null,null,"DB","N1","N2","SX","KC","MC","ZK","s1",null,"TM","DB","N1","N2","KC","MC",null,"ZK","N1","N2","N3","OP"]
[1,null,null,null,"Aチーム1区",null,"ゼッケン初期値",{"$f":"表紙!H4","v":""},null,null,{"$f":"IF($D3=\"\",\"\",B3*100000000+$H$5+$H$6+$A3)","v":""},{"$f":"IF($C3=\"\",\"\",CONCATENATE(C3,\"(\",B3,\")\",))","v":""},{"$f":"IF($C3=\"\",\"\",D3)","v":""},{"$f":"IF($C3=\"\",\"\",1)","v":""},{"$f":"IF($C3=\"\",\"\",10)","v":""},{"$f":"IF($C3=\"\",\"\",$H$2)","v":""},{"$f":"IF($C3=\"\",\"\",K3)","v":""},{"$f":"IF(C3=\"\",\"\",CONCATENATE(\"R17209\"))","v":""},0,{"$f":"IF(K3=\"\",\"\",$H$2*10+S3)","v":""},{"$f":"IF(K3=\"\",\"\",K3)","v":""},{"$f":"IF(U3=\"\",\"\",L3)","v":""},{"$f":"IF(V3=\"\",\"\",M3)","v":""},{"$f":"IF(W3=\"\",\"\",O3)","v":""},{"$f":"IF(X3=\"\",\"\",P3)","v":""},"A",{"$f":"IF(T3=\"\",\"\",T3)","v":""},{"$f":"IF($AA$3=\"\",\"\",CONCATENATE($H$4,\" \",$Z3))","v":""},{"$f":"IF($AA$3=\"\",\"\",表紙!$B$3)","v":""},{"$f":"IF($AA$3=\"\",\"\",CONCATENATE(\"指導者\",\" \",表紙!$B$4))","v":""},{"$f":"IF(AA3=\"\",\"\",0)","v":""}]
[2,null,null,null,"Aチーム2区",null,"クラブ略称",{"$f":"表紙!H5","v":""},null,null,{"$f":"IF($D4=\"\",\"\",B4*100000000+$H$5+$H$6+$A4)","v":""},{"$f":"IF($C4=\"\",\"\",CONCATENATE(C4,\"(\",B4,\")\",))","v":""},{"$f":"IF($C4=\"\",\"\",D4)","v":""},{"$f":"IF($C4=\"\",\"\",1)","v":""},{"$f":"IF($C4=\"\",\"\",10)","v":""},{"$f":"IF($C4=\"\",\"\",$H$2)","v":""},{"$f":"IF($C4=\"\",\"\",K4)","v":""},"",0,{"$f":"IF(K4=\"\",\"\",$H$2*10+S4)","v":""},{"$f":"IF(K4=\"\",\"\",K4)","v":""},{"$f":"IF(U4=\"\",\"\",L4)","v":""},"",{"$f":"IF(W4=\"\",\"\",O4)","v":""},""]
[3,null,null,null,"Aチーム3区",null,"DB初期値",{"$f":"表紙!H6","v":""},null,null,"","","","","","","","",0,"","","","","",""]
[4,null,null,null,"Aチーム4区",null,"種目固有数",400,null,null,"","","","","","","","",0,"","","","","",""]
[5,null,null,null,"Aチーム5区",null,"学年",5,null,null,"","","","","","","","",0,"","","","","",""]
[6,null,null,null,"Bチーム1区",null,null,6,null,null,"","","","","","","","",1,"","","","","","","B",{"$f":"IF(T8=\"\",\"\",T8)","v":""},{"$f":"IF($AA$3=\"\",\"\",CONCATENATE($H$4,\" \",$Z8))","v":""},{"$f":"IF($AA$3=\"\",\"\",表紙!$B$3)","v":""},{"$f":"IF($AA$3=\"\",\"\",CONCATENATE(\"指導者\",\" \",表紙!$B$4))","v":""},{"$f":"IF(AA8=\"\",\"\",0)","v":""}]
[7,null,null,null,"Bチーム2区",null,null,null,null,null,"","",{"$f":"IF($C9=\"\",\"\",D9)","v":""},{"$f":"IF($C9=\"\",\"\",1)","v":""},{"$f":"IF($C9=\"\",\"\",10)","v":""},{"$f":"IF($C9=\"\",\"\",$H$2)","v":""},{"$f":"IF($C9=\"\",\"\",K9)","v":""},"",1,"","","","","",""]
[8,null,null,null,"Bチーム3区",null,"性別","男",null,null,"","",{"$f":"IF($C10=\"\",\"\",D10)","v":""},"","","",{"$f":"IF($C10=\"\",\"\",K10)","v":""},"",1,"","","","","",""]
[9,null,null,null,"Bチーム4区",null,null,"女",null,null,"","","","","","","","",1,"","","","","",""]
[10,null,null,null,"Bチーム5区",null,null,null,null,null,"","","","","","","","",1,"","","","","",""]
[11,null,null,null,"Cチーム1区",null,null,null,null,null,"","","","","","","","",2,"","","","","","","C",{"$f":"IF(T13=\"\",\"\",T13)","v":""},{"$f":"IF($AA$3=\"\",\"\",CONCATENATE($H$4,\" \",$Z13))","v":""},{"$f":"IF($AA$3=\"\",\"\",表紙!$B$3)","v":""},{"$f":"IF($AA$3=\"\",\"\",CONCATENATE(\"指導者\",\" \",表紙!$B$4))","v":""},{"$f":"IF(AA13=\"\",\"\",0)","v":""}]
[12,null,null,null,"Cチーム2区",null,null,null,null,null,"","","","","","","","",2,"","","","","",""]
[13,null,null,null,"Cチーム3区",null,null,null,null,null,"","",{"$f":"IF($C15=\"\",\"\",D15)","v":""},{"$f":"IF($C15=\"\",\"\",1)","v":""},{"$f":"IF($C15=\"\",\"\",10)","v":""},{"$f":"IF($C15=\"\",\"\",$H$2)","v":""},{"$f":"IF($C15=\"\",\"\",K15)","v":""},"",2,"","","","","",""]
[14,null,null,null,"Cチーム4区",null,null,null,null,null,"","",{"$f":"IF($C16=\"\",\"\",D16)","v":""},"","","",{"$f":"IF($C16=\"\",\"\",K16)","v":""},"",2,"","","","","",""]
[15,null,null,null,"Cチーム5区",null,null,null,null,null,"","","","","","","","",2,"","","","","",""]
[16,null,null,null,"Dチーム1区",null,null,null,null,null,"","","","","","","","",3,"","","","","","","D",{"$f":"IF(T18=\"\",\"\",T18)","v":""},{"$f":"IF($AA$3=\"\",\"\",CONCATENATE($H$4,\" \",$Z18))","v":""},{"$f":"IF($AA$3=\"\",\"\",表紙!$B$3)","v":""},{"$f":"IF($AA$3=\"\",\"\",CONCATENATE(\"指導者\",\" \",表紙!$B$4))","v":""},{"$f":"IF(AA18=\"\",\"\",0)","v":""}]
[17,null,null,null,"Dチーム2区",null,null,null,null,null,"","","","","","","","",3,"","","","","",""]
[18,null,null,null,"Dチーム3区",null,null,null,null,null,"","","","","","","","",3,"","",{"$f":"IF(U20=\"\",\"\",L20)","v":""},"",{"$f":"IF(W20=\"\",\"\",O20)","v":""},""]
{"$rows_left_out":13}
{"sheet":"56女","index":5,"n_rows":32,"n_cols":31,"rows_kept":32,"cut":false,"hidden":false,"merged":[]}
[null,{"$f":"表紙!A1","v":"令和4"},"年度群馬県小学生駅伝競争大会　５６年女子　入力欄",null,null,null,null,null,null,null,"マスター系CSV作成",null,null,null,null,null,null,null,null,"メンバー系CSV作成",null,null,null,null,null,null,"チーム系CSV作成"]
["No.","学年","名前","フリガナ（半角カナ）","担当",null,"クラブコード",{"$f":"表紙!H3","v":""},null,null,"DB","N1","N2","SX","KC","MC","ZK","s1",null,"TM","DB","N1","N2","KC","MC",null,"ZK","N1","N2","N3","OP"]
[1,null,null,null,"Aチーム1区",null,"ゼッケン初期値",{"$f":"表紙!H4","v":""},null,null,{"$f":"IF($D3=\"\",\"\",B3*100000000+$H$5+$H$6+$A3)","v":""},{"$f":"IF($C3=\"\",\"\",CONCATENATE(C3,\"(\",B3,\")\",))","v":""},{"$f":"IF($C3=\"\",\"\",D3)","v":""},{"$f":"IF($C3=\"\",\"\",2)","v":""},{"$f":"IF($C3=\"\",\"\",10)","v":""},{"$f":"IF($C3=\"\",\"\",$H$2)","v":""},{"$f":"IF($C3=\"\",\"\",K3)","v":""},{"$f":"IF(C3=\"\",\"\",CONCATENATE(\"R17209\"))","v":""},0,{"$f":"IF(K3=\"\",\"\",$H$2*10+S3)","v":""},{"$f":"IF(K3=\"\",\"\",K3)","v":""},{"$f":"IF(U3=\"\",\"\",L3)","v":""},{"$f":"IF(V3=\"\",\"\",M3)","v":""},{"$f":"IF(W3=\"\",\"\",O3)","v":""},{"$f":"IF(X3=\"\",\"\",P3)","v":""},"A",{"$f":"IF(T3=\"\",\"\",T3)","v":""},{"$f":"IF($AA$3=\"\",\"\",CONCATENATE($H$4,\" \",$Z3))","v":""},{"$f":"IF($AA$3=\"\",\"\",表紙!$B$3)","v":""},{"$f":"IF($AA$3=\"\",\"\",CONCATENATE(\"指導者\",\" \",表紙!$B$4))","v":""},{"$f":"IF(AA3=\"\",\"\",0)","v":""}]
[2,null,null,null,"Aチーム2区",null,"クラブ略称",{"$f":"表紙!H5","v":""},null,null,{"$f":"IF($D4=\"\",\"\",B4*100000000+$H$5+$H$6+$A4)","v":""},{"$f":"IF($C4=\"\",\"\",CONCATENATE(C4,\"(\",B4,\")\",))","v":""},{"$f":"IF($C4=\"\",\"\",D4)","v":""},{"$f":"IF($C4=\"\",\"\",2)","v":""},{"$f":"IF($C4=\"\",\"\",10)","v":""},{"$f":"IF($C4=\"\",\"\",$H$2)","v":""},{"$f":"IF($C4=\"\",\"\",K4)","v":""},"",0,{"$f":"IF(K4=\"\",\"\",$H$2*10+S4)","v":""},{"$f":"IF(K4=\"\",\"\",K4)","v":""},{"$f":"IF(U4=\"\",\"\",L4)","v":""},"",{"$f":"IF(W4=\"\",\"\",O4)","v":""},""]
[3,null,null,null,"Aチーム3区",null,"DB初期値",{"$f":"表紙!H6","v":""},null,null,"","","","","","","","",0,"","","","","",""]
[4,null,null,null,"Aチーム4区",null,"種目固有数",500,null,null,"","","","","","","","",0,"","","","","",""]
[5,null,null,null,"Aチーム5区",null,"学年",5,null,null,"","","","","","","","",0,"","","","","",""]
[6,null,null,null,"Bチーム1区",null,null,6,null,null,"","","","","","","","",1,"","","","","","","B",{"$f":"IF(T8=\"\",\"\",T8)","v":""},{"$f":"IF($AA$3=\"\",\"\",CONCATENATE($H$4,\" \",$Z8))","v":""},{"$f":"IF($AA$3=\"\",\"\",表紙!$B$3)","v":""},{"$f":"IF($AA$3=\"\",\"\",CONCATENATE(\"指導者\",\" \",表紙!$B$4))","v":""},{"$f":"IF(AA8=\"\",\"\",0)","v":""}]
[7,null,null,null,"Bチーム2区",null,null,null,null,null,"","",{"$f":"IF($C9=\"\",\"\",D9)","v":""},"",{"$f":"IF($C9=\"\",\"\",10)","v":""},{"$f":"IF($C9=\"\",\"\",$H$2)","v":""},{"$f":"IF($C9=\"\",\"\",K9)","v":""},"",1,"","","","","",""]
[8,null,null,null,"Bチーム3区",null,"性別","男",null,null,"","",{"$f":"IF($C10=\"\",\"\",D10)","v":""},"","","",{"$f":"IF($C10=\"\",\"\",K10)","v":""},"",1,"","","","","",""]
[9,null,null,null,"Bチーム4区",null,null,"女",null,null,"","","","","","","","",1,"","","","","",""]
[10,null,null,null,"Bチーム5区",null,null,null,null,null,"","","","","","","","",1,"","","","","",""]
[11,null,null,null,"Cチーム1区",null,null,null,null,null,"","","","","","","","",2,"","","","","","","C",{"$f":"IF(T13=\"\",\"\",T13)","v":""},{"$f":"IF($AA$3=\"\",\"\",CONCATENATE($H$4,\" \",$Z13))","v":""},{"$f":"IF($AA$3=\"\",\"\",表紙!$B$3)","v":""},{"$f":"IF($AA$3=\"\",\"\",CONCATENATE(\"指導者\",\" \",表紙!$B$4))","v":""},{"$f":"IF(AA13=\"\",\"\",0)","v":""}]
[12,null,null,null,"Cチーム2区",null,null,null,null,null,"","","","","","","","",2,"","","","","",""]
[13,null,null,null,"Cチーム3区",null,null,null,null,null,"","",{"$f":"IF($C15=\"\",\"\",D15)","v":""},"",{"$f":"IF($C15=\"\",\"\",10)","v":""},{"$f":"IF($C15=\"\",\"\",$H$2)","v":""},{"$f":"IF($C15=\"\",\"\",K15)","v":""},"",2,"","","","","",""]
[14,null,null,null,"Cチーム4区",null,null,null,null,null,"","",{"$f":"IF($C16=\"\",\"\",D16)","v":""},"","","",{"$f":"IF($C16=\"\",\"\",K16)","v":""},"",2,"","","","","",""]
[15,null,null,null,"Cチーム5区",null,null,null,null,null,"","","","","","","","",2,"","","","","",""]
[16,null,null,null,"Dチーム1区",null,null,null,null,null,"","","","","","","","",3,"","","","","","","D",{"$f":"IF(T18=\"\",\"\",T18)","v":""},{"$f":"IF($AA$3=\"\",\"\",CONCATENATE($H$4,\" \",$Z18))","v":""},{"$f":"IF($AA$3=\"\",\"\",表紙!$B$3)","v":""},{"$f":"IF($AA$3=\"\",\"\",CONCATENATE(\"指導者\",\" \",表紙!$B$4))","v":""},{"$f":"IF(AA18=\"\",\"\",0)","v":""}]
[17,null,null,null,"Dチーム2区",null,null,null,null,null,"","","","","","","","",3,"","","","","",""]
[18,null,null,null,"Dチーム3区",null,null,null,null,null,"","","","","","","","",3,"","",{"$f":"IF(U20=\"\",\"\",L20)","v":""},"",{"$f":"IF(W20=\"\",\"\",O20)","v":""},""]
{"$rows_left_out":13}
{"sheet":"syozoku","index":6,"n_rows":51,"n_cols":6,"rows_kept":51,"cut":false,"hidden":false,"merged":[]}
["DB","N1","N2","N3","KC","code"]
[1,"ﾀｶｻｷｼﾘｯｷｮｳ","高崎市陸上競技協会","高崎市陸協",10,1]
[2,"ｱｶﾞﾂﾏｼﾝﾚｲｸﾗﾌﾞ","吾妻榛嶺クラブ","吾妻榛嶺ｸﾗﾌﾞ",10,2]
[3,"ｳｽｲｸﾗﾌﾞ","碓氷陸上競技クラブ","碓氷ｸﾗﾌﾞ",10,3]
[4,"ﾀﾃﾊﾞﾔｼｸﾗﾌﾞ","館林陸上競技クラブ","館林ｸﾗﾌﾞ",10,4]
[5,"ｼﾌﾞｶﾜｸﾗﾌﾞ","渋川陸上競技クラブ","渋川ｸﾗﾌﾞ",10,5]
[6,"ﾌｼﾞｵｶｸﾗﾌﾞ","藤岡市陸上競技クラブ","藤岡ｸﾗﾌﾞ",10,6]
[7,"ｾﾀｸﾗﾌﾞ","勢多陸上競技クラブ","勢多ｸﾗﾌﾞ",10,7]
[8,"ﾏｴﾊﾞｼｼﾘｯｷｮｳ","前橋市陸上競技協会","前橋市陸協",10,8]
[9,"ｷﾘｭｳｼﾘｯｷｮｳ","桐生市陸上競技協会","桐生市陸協",10,9]
[10,"ﾄﾈｸﾗﾌﾞ","利根陸上競技クラブ","利根ｸﾗﾌﾞ",10,10]
[11,"ﾇﾏﾀｸﾗﾌﾞ","沼田市陸上クラブ","沼田ｸﾗﾌﾞ",10,11]
[12,"ﾄﾐｵｶｼﾘｯｷｮｳ","富岡市陸上競技協会","富岡市陸協",10,12]
[13,"ｲｾｻｷｸﾗﾌﾞ","伊勢崎陸上競技クラブ","伊勢崎ｸﾗﾌﾞ",10,13]
[14,"ﾆｯﾀｸﾗﾌﾞ","新田陸上競技倶楽部","新田倶楽部",10,14]
[15,"ｼﾞｮｳｼｭｳAC","上州アスリートクラブ","上州ｱｽﾘｰﾄｸﾗﾌﾞ",10,15]
[16,"ｵｵﾀｼﾘｯｷｮｳ","太田市陸上競技協会","太田市陸協",10,16]
[17,"ｱﾝﾅｶｼﾘｯｷｮｳ","安中市陸上競技協会","安中市陸協",10,17]
[18,"ｻｶｲｸﾗﾌﾞ","境陸上競技クラブ","境ｸﾗﾌﾞ",10,18]
[19,"ﾁｰﾑK","チームＫ","ﾁｰﾑK",10,19]
{"$rows_left_out":31}