{"text_format":"1","workbook":"xlsx","n_sheets":9,"sheets":["使用上の注意","個人種目登録","リレー登録","選手DBﾃﾞｰﾀ取得","ﾘﾚｰﾃﾞｰﾀ取得","所属データ","基礎データ","競技データ","処理用"],"not_rendered":{"charts":0,"images":0,"macros":1,"external_links":0,"defined_names":9,"comments":0,"pivot_tables":0},"unopened":[],"bounds":{"document_bytes":16777216,"sheet_cells":100000,"rows_first":2000,"rows_last":500,"rows_between":2000,"halvings":0,"cell_chars":16384,"cell_head_chars":4096},"cells_cut":0,"cells_raw":0,"read":"whole","date_system":"1900"}

{"sheet":"使用上の注意","index":0,"n_rows":40,"n_cols":5,"rows_kept":40,"cut":false,"hidden":false,"merged":[]}
[]
[null,"2023　日清食品カップ　兼　第1回U-12選抜陸上競技記録会　申込"]
[]
[null,"＊使用上の注意＊　必ずマクロを有効にしてご利用ください！"]
[]
[null,"１　クラブ名の入力"]
[null,null,"カーソルをセルにあわせ、表示されるリストの中から選択してください。"]
[null,null,"審判員については、直接清水先生までメール等で連絡してください。"]
{"$rows_left_out":33}
{"sheet":"個人種目登録","index":1,"n_rows":208,"n_cols":61,"rows_kept":208,"cut":false,"hidden":false,"merged":[[1,9,2,12],[1,13,2,14],[1,8,2,8],[7,9,7,11],[6,15,6,16],[6,30,6,32],[3,1,3,2],[3,3,3,7],[3,13,3,14],[3,9,3,12],[5,35,7,35],[5,2,7,2],[5,3,7,3],[5,8,7,8],[5,6,6,7],[6,12,6,14],[5,4,7,4],[7,12,7,14],[6,9,6,11],[5,5,7,5],[5,26,7,26],[5,27,5,34],[7,24,7,25],[5,9,5,16],[6,33,6,34],[7,27,7,29],[1,18,1,25],[7,30,7,32],[7,33,7,34],[7,15,7,16],[6,18,6,20],[5,18,5,25],[6,24,6,25],[7,18,7,20],[7,21,7,23],[5,17,7,17],[6,21,6,23],[3,19,3,21],[3,15,3,18],[3,22,3,25],[3,26,3,28],[6,27,6,29]]}
[null,null,null,null,null,null,null,null,null,null,null,null,null,null,null,null,null,null,null,null,null,null,null,null,null,null,null,null,null,null,null,null,null,null,null,null,null,null,null,null,null,null,null,null,null,null,null,null,null,null,null,null,null,null,null,null,null,null,null,{"$f":"IF(AJ1=\"親子リレー申込\",\"R025\"&AQ1,\"\")","v":""}]
[null,{"$f":"使用上の注意!B2","v":"2023　日清食品カップ　兼　第1回U-12選抜陸上競技記録会　申込"},null,null,null,null,null,null,"プロ申込数","リレーチーム数",null,null,null,{"$f":"リレー登録!O1","v":0},null,null,null,null,"コード一覧表を見る",null,null,null,null,null,null,null,null,null,null,null,null,null,null,null,null,null,null,null,null,null,null,null,null,null,null,null,null,null,null,null,null,null,null,null,null,null,null,null,null,""]
[null,null,null,null,null,null,null,null,null,null,null,null,null,null,null,null,null,null,null,null,null,null,null,null,null,null,null,null,null,null,null,null,null,null,null,null,null,null,null,null,null,null,null,null,null,null,null,null,null,null,null,null,null,null,null,null,null,null,null,""]
[null,"クラブ名",null,"群馬陸上競技協会",null,null,null,null,{"$f":"N4","v":0},"実参加人数",null,null,null,{"$f":"200-COUNTIF($C$9:$C$208,\"\")","v":0},null,"延べ参加個人種目数",null,null,null,{"$f":"600-COUNTIF(I9:I208,\"\")-COUNTIF(R9:R208,\"\")-COUNTIF(AA9:AA208,\"\")","v":0},null,null,"参加費用",null,null,null,"手計算でお願いします",null,null,null,null,null,null,null,null,null,null,null,null,null,null,null,null,null,null,null,null,null,null,null,null,null,null,null,null,null,null,null,null,""]
[null,null,null,null,null,null,null,null,{"$f":"IF($E5=\"\",\"\",VLOOKUP($E5,基礎データ!$N$3:$Q$10,2,FALSE))","v":""},null,null,null,null,null,null,null,null,{"$f":"IF($E5=\"\",\"\",VLOOKUP($E5,基礎データ!$N$3:$Q$10,3,FALSE))","v":""},null,null,null,null,null,null,null,null,{"$f":"IF($E5=\"\",\"\",VLOOKUP($E5,基礎データ!$N$3:$Q$10,4,FALSE))","v":""},null,null,null,null,null,null,null,null,null,null,null,null,null,null,null,null,null,null,null,null,null,null,null,null,null,null,null,null,null,null,null,null,""]
[null,null,"漢字氏名","ｶﾅ氏名","学年","性別","学校・クラブ名",null,"種目１","申込記録",null,null,null,null,null,null,null,"種目２","申込記録",null,null,null,null,null,null,null,"種目３","申込記録",null,null,null,null,null,null,null,"備考",null,null,"ｸﾗﾌﾞｺｰﾄﾞ",{"$f":"IF(D4=\"\",\"\",VLOOKUP(D4,基礎データ!B:C,2,FALSE))","v":10}]
[null,"No",null,null,null,null,null,null,null,"m",null,null,"cm",null,null,null,null,null,"m",null,null,"cm",null,null,null,null,null,"m",null,null,"cm",null,null,null,null,null,null,null,"ｸﾗﾌﾞDB",{"$f":"AN6*100","v":1000},null,null,null,null,null,null,null,null,null,null,null,null,null,null,null,null,null,null,null,"","３００ｍ"]
[null,null,null,null,null,null,"ｺｰﾄﾞ","学校・クラブ名",null,"分",null,null,"秒",null,null,"1/100秒",null,null,"分",null,null,"秒",null,null,"1/100秒",null,null,"分",null,null,"秒",null,null,"1/100秒",null,null,null,null,"№","選手No.","性別ｺｰﾄﾞ","選手DB","学年ｺｰﾄﾞ","氏名","KC","MC","種目1ｺｰﾄﾞ","S1","種目2ｺｰﾄﾞ","S2","種目3ｺｰﾄﾞ","S3","CK1","CK2","CK3","iserror",null,null,"count","","５００ｍ"]
{"$rows_left_out":201}
{"sheet":"リレー登録","index":2,"n_rows":55,"n_cols":40,"rows_kept":55,"cut":false,"hidden":false,"merged":[[53,2,54,2],[49,1,54,1],[53,5,54,5],[53,6,54,6],[53,7,54,7],[53,8,54,8],[53,9,54,9],[53,10,54,10],[53,11,54,11],[51,2,52,2],[51,5,52,5],[51,6,52,6],[51,7,52,7],[51,8,52,8],[51,9,52,9],[51,10,52,10],[51,11,52,11],[47,1,48,2],[47,3,48,3],[47,4,48,4],[47,5,48,11],[47,12,47,15],[47,16,47,19],[49,2,50,2],[49,5,50,5],[49,6,50,6],[49,7,50,7],[49,8,50,8],[49,9,50,9],[49,10,50,10],[49,11,50,11],[38,11,39,11],[32,5,33,5],[38,2,39,2],[38,5,39,5],[3,1,12,1],[13,1,22,1],[26,1,35,1],[36,1,45,1],[24,16,24,19],[44,2,45,2],[40,10,41,10],[42,2,43,2],[42,5,43,5],[42,6,43,6],[42,7,43,7],[42,8,43,8],[42,9,43,9],[40,2,41,2],[40,5,41,5],[40,6,41,6],[38,6,39,6],[38,7,39,7],[38,8,39,8],[30,6,31,6],[1,12,1,19],[40,7,41,7],[40,8,41,8],[44,11,45,11],[1,3,2,3],[42,10,43,10],[42,11,43,11],[40,11,41,11],[36,11,37,11],[34,10,35,10],[34,11,35,11],[32,11,33,11],[28,11,29,11],[26,10,27,10],[26,11,27,11],[38,9,39,9],[38,10,39,10],[44,5,45,5],[44,6,45,6],[44,7,45,7],[44,8,45,8],[44,9,45,9],[44,10,45,10],[40,9,41,9],[36,10,37,10],[32,9,33,9],[32,10,33,10],[34,2,35,2],[34,5,35,5],[34,6,35,6],[34,7,35,7],[34,8,35,8],[34,9,35,9],[32,2,33,2],[36,2,37,2],[36,5,37,5],[36,6,37,6],[36,7,37,7],[36,8,37,8],[36,9,37,9],[32,6,33,6],[32,7,33,7],[32,8,33,8],[24,12,24,15],[26,2,27,2],[26,5,27,5],[26,6,27,6],[26,7,27,7],[26,8,27,8],[26,9,27,9],[24,1,25,2],[24,4,25,4],[24,3,25,3],[28,2,29,2],[28,5,29,5],[28,6,29,6],[28,7,29,7],[28,8,29,8],[28,9,29,9],[28,10,29,10],[24,5,25,11],[30,2,31,2],[30,5,31,5],[30,11,31,11],[30,10,31,10],[30,7,31,7],[30,8,31,8],[30,9,31,9],[21,6,22,6],[21,7,22,7],[21,8,22,8],[21,9,22,9],[21,10,22,10],[21,11,22,11],[19,5,20,5],[19,6,20,6],[19,7,20,7],[19,8,20,8],[19,9,20,9],[19,10,20,10],[19,11,20,11],[21,5,22,5],[17,5,18,5],[17,6,18,6],[17,7,18,7],[17,8,18,8],[17,9,18,9],[17,10,18,10],[17,11,18,11],[15,5,16,5],[15,6,16,6],[15,7,16,7],[15,8,16,8],[15,9,16,9],[13,8,14,8],[13,9,14,9],[13,10,14,10],[13,11,14,11],[13,5,14,5],[13,6,14,6],[13,7,14,7],[15,10,16,10],[15,11,16,11],[7,11,8,11],[9,8,10,8],[9,9,10,9],[9,10,10,10],[9,11,10,11],[9,5,10,5],[9,6,10,6],[9,7,10,7],[11,5,12,5],[11,6,12,6],[11,7,12,7],[11,8,12,8],[11,9,12,9],[11,10,12,10],[11,11,12,11],[3,8,4,8],[3,9,4,9],[3,10,4,10],[7,5,8,5],[7,6,8,6],[7,7,8,7],[7,8,8,8],[7,9,8,9],[7,10,8,10],[3,11,4,11],[1,5,2,11],[5,11,6,11],[19,2,20,2],[21,2,22,2],[3,5,4,5],[3,6,4,6],[3,7,4,7],[3,2,4,2],[5,2,6,2],[7,2,8,2],[9,2,10,2],[11,2,12,2],[13,2,14,2],[15,2,16,2],[17,2,18,2],[1,4,2,4],[1,1,2,2],[5,5,6,5],[5,6,6,6],[5,7,6,7],[5,8,6,8],[5,9,6,9],[5,10,6,10]]}
[null,"リレーエントリーシート",null,null,null,null,null,null,null,null,null,null,null,"参加チーム数",{"$f":"27-COUNTIF(E4:E55,\"\")","v":0}]
[null,null,null,"種別","チーム名","タイム",null,null,null,null,null,null,"選手No.（上段にNo.を入力。下段に氏名が自動表示されます）"]
[null,null,null,null,null,null,null,null,null,null,null,null,"選手１","選手２","選手３","選手４","選手５","選手６","選手７","選手８",null,null,null,null,"DB","ZK","KC","N1","N2","TM","KM","LN","S1","S2","S3","S4","S5","S6","S7","S8"]
[null,"５・６・中学男子",1,"小学",{"$f":"IF(M4=\"\",\"\",CONCATENATE(個人種目登録!$D$4,リレー登録!U4))","v":""},0,"分",0,0,"秒",null,null,null,null,null,null,null,null,null,null," A",null,null,"小学",{"$f":"IF(E4=\"\",\"\",個人種目登録!$AN$7&リレー登録!C4)","v":""},{"$f":"IF(Y4=\"\",\"\",Y4)","v":""},{"$f":"IF(Y4=\"\",\"\",個人種目登録!$AN$6)","v":""},{"$f":"IF(D4=\"\",\"\",E4)","v":""},null,{"$f":"IF(Y4=\"\",\"\",F4&H4&I4&K4&L4)","v":""},null,null,{"$f":"IF(M4=\"\",\"\",VLOOKUP(M4,個人種目登録!$AM$9:$AP$208,4,FALSE))","v":""},{"$f":"IF(N4=\"\",\"\",VLOOKUP(N4,個人種目登録!$AM$9:$AP$208,4,FALSE))","v":""},{"$f":"IF(O4=\"\",\"\",VLOOKUP(O4,個人種目登録!$AM$9:$AP$208,4,FALSE))","v":""},{"$f":"IF(P4=\"\",\"\",VLOOKUP(P4,個人種目登録!$AM$9:$AP$208,4,FALSE))","v":""},{"$f":"IF(Q4=\"\",\"\",VLOOKUP(Q4,個人種目登録!$AM$9:$AP$208,4,FALSE))","v":""},{"$f":"IF(R4=\"\",\"\",VLOOKUP(R4,個人種目登録!$AM$9:$AP$208,4,FALSE))","v":""},{"$f":"IF(S4=\"\",\"\",VLOOKUP(S4,個人種目登録!$AM$9:$AP$208,4,FALSE))","v":""},{"$f":"IF(T4=\"\",\"\",VLOOKUP(T4,個人種目登録!$AM$9:$AP$208,4,FALSE))","v":""}]
[null,null,null,"×","×",null,null,null,null,null,null,null,{"$f":"IF(M4=\"\",\"\",VLOOKUP(M4,個人種目登録!$AM:$AR,6,FALSE))","v":""},{"$f":"IF(N4=\"\",\"\",VLOOKUP(N4,個人種目登録!$AM:$AR,6,FALSE))","v":""},{"$f":"IF(O4=\"\",\"\",VLOOKUP(O4,個人種目登録!$AM:$AR,6,FALSE))","v":""},{"$f":"IF(P4=\"\",\"\",VLOOKUP(P4,個人種目登録!$AM:$AR,6,FALSE))","v":""},{"$f":"IF(Q4=\"\",\"\",VLOOKUP(Q4,個人種目登録!$AM:$AR,6,FALSE))","v":""},{"$f":"IF(R4=\"\",\"\",VLOOKUP(R4,個人種目登録!$AM:$AR,6,FALSE))","v":""},{"$f":"IF(S4=\"\",\"\",VLOOKUP(S4,個人種目登録!$AM:$AR,6,FALSE))","v":""},{"$f":"IF(T4=\"\",\"\",VLOOKUP(T4,個人種目登録!$AM:$AR,6,FALSE))","v":""},null,{"$f":"IF(E5=\"\",\"\",IF(D5=\"中学男子\",E5&\"(中)\",E5))","v":"×"},null,"中学",{"$f":"IF(E4=\"\",\"\",個人種目登録!$AN$7&リレー登録!C5)","v":""},{"$f":"IF(Y5=\"\",\"\",Y5)","v":""},{"$f":"IF(Y5=\"\",\"\",個人種目登録!$AN$6)","v":""},{"$f":"IF(D5=\"\",\"\",E5)","v":"×"},null,{"$f":"IF(Y5=\"\",\"\",F5&H5&I5&K5&L5)","v":""},null,null,{"$f":"IF(M5=\"\",\"\",VLOOKUP(M5,個人種目登録!$AM$9:$AP$208,4,FALSE))","v":""},{"$f":"IF(N5=\"\",\"\",VLOOKUP(N5,個人種目登録!$AM$9:$AP$208,4,FALSE))","v":""},{"$f":"IF(O5=\"\",\"\",VLOOKUP(O5,個人種目登録!$AM$9:$AP$208,4,FALSE))","v":""},{"$f":"IF(P5=\"\",\"\",VLOOKUP(P5,個人種目登録!$AM$9:$AP$208,4,FALSE))","v":""},{"$f":"IF(Q5=\"\",\"\",VLOOKUP(Q5,個人種目登録!$AM$9:$AP$208,4,FALSE))","v":""},{"$f":"IF(R5=\"\",\"\",VLOOKUP(R5,個人種目登録!$AM$9:$AP$208,4,FALSE))","v":""},{"$f":"IF(S5=\"\",\"\",VLOOKUP(S5,個人種目登録!$AM$9:$AP$208,4,FALSE))","v":""},{"$f":"IF(T5=\"\",\"\",VLOOKUP(T5,個人種目登録!$AM$9:$AP$208,4,FALSE))","v":""}]
[null,null,2,"小学",{"$f":"IF(M6=\"\",\"\",CONCATENATE(個人種目登録!$D$4,リレー登録!U6))","v":""},0,"分",0,0,"秒",null,null,null,null,null,null,null,null,null,null," B","",null,null,{"$f":"IF(E6=\"\",\"\",個人種目登録!$AN$7&リレー登録!C6)","v":""},"",{"$f":"IF(Y6=\"\",\"\",個人種目登録!$AN$6)","v":""},"",null,"",null,null,{"$f":"IF(M6=\"\",\"\",VLOOKUP(M6,個人種目登録!$AM$9:$AP$208,4,FALSE))","v":""},{"$f":"IF(N6=\"\",\"\",VLOOKUP(N6,個人種目登録!$AM$9:$AP$208,4,FALSE))","v":""},{"$f":"IF(O6=\"\",\"\",VLOOKUP(O6,個人種目登録!$AM$9:$AP$208,4,FALSE))","v":""},{"$f":"IF(P6=\"\",\"\",VLOOKUP(P6,個人種目登録!$AM$9:$AP$208,4,FALSE))","v":""},{"$f":"IF(Q6=\"\",\"\",VLOOKUP(Q6,個人種目登録!$AM$9:$AP$208,4,FALSE))","v":""},{"$f":"IF(R6=\"\",\"\",VLOOKUP(R6,個人種目登録!$AM$9:$AP$208,4,FALSE))","v":""},{"$f":"IF(S6=\"\",\"\",VLOOKUP(S6,個人種目登録!$AM$9:$AP$208,4,FALSE))","v":""},{"$f":"IF(T6=\"\",\"\",VLOOKUP(T6,個人種目登録!$AM$9:$AP$208,4,FALSE))","v":""}]
[null,null,null,"×","×",null,null,null,null,null,null,null,{"$f":"IF(M6=\"\",\"\",VLOOKUP(M6,個人種目登録!$AM:$AR,6,FALSE))","v":""},{"$f":"IF(N6=\"\",\"\",VLOOKUP(N6,個人種目登録!$AM:$AR,6,FALSE))","v":""},{"$f":"IF(O6=\"\",\"\",VLOOKUP(O6,個人種目登録!$AM:$AR,6,FALSE))","v":""},{"$f":"IF(P6=\"\",\"\",VLOOKUP(P6,個人種目登録!$AM:$AR,6,FALSE))","v":""},{"$f":"IF(Q6=\"\",\"\",VLOOKUP(Q6,個人種目登録!$AM:$AR,6,FALSE))","v":""},{"$f":"IF(R6=\"\",\"\",VLOOKUP(R6,個人種目登録!$AM:$AR,6,FALSE))","v":""},{"$f":"IF(S6=\"\",\"\",VLOOKUP(S6,個人種目登録!$AM:$AR,6,FALSE))","v":""},{"$f":"IF(T6=\"\",\"\",VLOOKUP(T6,個人種目登録!$AM:$AR,6,FALSE))","v":""},null,"×",null,null,{"$f":"IF(E6=\"\",\"\",個人種目登録!$AN$7&リレー登録!C7)","v":""},"",{"$f":"IF(Y7=\"\",\"\",個人種目登録!$AN$6)","v":""},"×",null,"",null,null,{"$f":"IF(M7=\"\",\"\",VLOOKUP(M7,個人種目登録!$AM$9:$AP$208,4,FALSE))","v":""},{"$f":"IF(N7=\"\",\"\",VLOOKUP(N7,個人種目登録!$AM$9:$AP$208,4,FALSE))","v":""},{"$f":"IF(O7=\"\",\"\",VLOOKUP(O7,個人種目登録!$AM$9:$AP$208,4,FALSE))","v":""},{"$f":"IF(P7=\"\",\"\",VLOOKUP(P7,個人種目登録!$AM$9:$AP$208,4,FALSE))","v":""},{"$f":"IF(Q7=\"\",\"\",VLOOKUP(Q7,個人種目登録!$AM$9:$AP$208,4,FALSE))","v":""},{"$f":"IF(R7=\"\",\"\",VLOOKUP(R7,個人種目登録!$AM$9:$AP$208,4,FALSE))","v":""},{"$f":"IF(S7=\"\",\"\",VLOOKUP(S7,個人種目登録!$AM$9:$AP$208,4,FALSE))","v":""},{"$f":"IF(T7=\"\",\"\",VLOOKUP(T7,個人種目登録!$AM$9:$AP$208,4,FALSE))","v":""}]
[null,null,3,"小学",{"$f":"IF(M8=\"\",\"\",CONCATENATE(個人種目登録!$D$4,リレー登録!U8))","v":""},0,"分",0,0,"秒",null,null,null,null,null,null,null,null,null,null," C","",null,null,{"$f":"IF(E8=\"\",\"\",個人種目登録!$AN$7&リレー登録!C8)","v":""},"",{"$f":"IF(Y8=\"\",\"\",個人種目登録!$AN$6)","v":""},"",null,"",null,null,{"$f":"IF(M8=\"\",\"\",VLOOKUP(M8,個人種目登録!$AM$9:$AP$208,4,FALSE))","v":""},{"$f":"IF(N8=\"\",\"\",VLOOKUP(N8,個人種目登録!$AM$9:$AP$208,4,FALSE))","v":""},{"$f":"IF(O8=\"\",\"\",VLOOKUP(O8,個人種目登録!$AM$9:$AP$208,4,FALSE))","v":""},{"$f":"IF(P8=\"\",\"\",VLOOKUP(P8,個人種目登録!$AM$9:$AP$208,4,FALSE))","v":""},{"$f":"IF(Q8=\"\",\"\",VLOOKUP(Q8,個人種目登録!$AM$9:$AP$208,4,FALSE))","v":""},{"$f":"IF(R8=\"\",\"\",VLOOKUP(R8,個人種目登録!$AM$9:$AP$208,4,FALSE))","v":""},{"$f":"IF(S8=\"\",\"\",VLOOKUP(S8,個人種目登録!$AM$9:$AP$208,4,FALSE))","v":""},{"$f":"IF(T8=\"\",\"\",VLOOKUP(T8,個人種目登録!$AM$9:$AP$208,4,FALSE))","v":""}]
{"$rows_left_out":48}
{"sheet":"選手DBﾃﾞｰﾀ取得","index":3,"n_rows":201,"n_cols":17,"rows_kept":201,"cut":false,"hidden":false,"merged":[]}
["DB","N1","N2","SX","KC","MC","TL","WT","ZK","S1","S2","S3","S4",null,null,null,{"$f":"199-COUNTIF(A2:A101,\"\")","v":99}]
[{"$f":"IF(個人種目登録!AP9=\"\",\"\",個人種目登録!AP9)","v":""},{"$f":"IF(個人種目登録!AR9=\"\",\"\",個人種目登録!AR9)","v":""},{"$f":"IF(個人種目登録!D9=\"\",\"\",個人種目登録!D9)","v":""},{"$f":"IF(個人種目登録!AO9=\"\",\"\",個人種目登録!AO9)","v":""},{"$f":"IF(個人種目登録!AS9=\"\",\"\",個人種目登録!AS9)","v":""},{"$f":"IF(個人種目登録!AT9=\"\",\"\",個人種目登録!AT9)","v":""},null,null,{"$f":"IF(個人種目登録!AN9=\"\",\"\",個人種目登録!AN9)","v":""},{"$f":"IF(個人種目登録!AV9=\"\",\"\",個人種目登録!AV9)","v":""},{"$f":"IF(個人種目登録!AX9=\"\",\"\",個人種目登録!AX9)","v":""},{"$f":"IF(個人種目登録!AZ9=\"\",\"\",個人種目登録!AZ9)","v":""},{"$f":"IF(個人種目登録!BH9=\"\",\"\",個人種目登録!BH9)","v":""}]
[{"$f":"IF(個人種目登録!AP10=\"\",\"\",個人種目登録!AP10)","v":""},{"$f":"IF(個人種目登録!AR10=\"\",\"\",個人種目登録!AR10)","v":""},{"$f":"IF(個人種目登録!D10=\"\",\"\",個人種目登録!D10)","v":""},{"$f":"IF(個人種目登録!AO10=\"\",\"\",個人種目登録!AO10)","v":""},{"$f":"IF(個人種目登録!AS10=\"\",\"\",個人種目登録!AS10)","v":""},{"$f":"IF(個人種目登録!AT10=\"\",\"\",個人種目登録!AT10)","v":""},null,null,{"$f":"IF(個人種目登録!AN10=\"\",\"\",個人種目登録!AN10)","v":""},{"$f":"IF(個人種目登録!AV10=\"\",\"\",個人種目登録!AV10)","v":""},{"$f":"IF(個人種目登録!AX10=\"\",\"\",個人種目登録!AX10)","v":""},{"$f":"IF(個人種目登録!AZ10=\"\",\"\",個人種目登録!AZ10)","v":""},{"$f":"IF(個人種目登録!BH10=\"\",\"\",個人種目登録!BH10)","v":""}]
[{"$f":"IF(個人種目登録!AP11=\"\",\"\",個人種目登録!AP11)","v":""},{"$f":"IF(個人種目登録!AR11=\"\",\"\",個人種目登録!AR11)","v":""},{"$f":"IF(個人種目登録!D11=\"\",\"\",個人種目登録!D11)","v":""},{"$f":"IF(個人種目登録!AO11=\"\",\"\",個人種目登録!AO11)","v":""},{"$f":"IF(個人種目登録!AS11=\"\",\"\",個人種目登録!AS11)","v":""},{"$f":"IF(個人種目登録!AT11=\"\",\"\",個人種目登録!AT11)","v":""},null,null,{"$f":"IF(個人種目登録!AN11=\"\",\"\",個人種目登録!AN11)","v":""},{"$f":"IF(個人種目登録!AV11=\"\",\"\",個人種目登録!AV11)","v":""},{"$f":"IF(個人種目登録!AX11=\"\",\"\",個人種目登録!AX11)","v":""},{"$f":"IF(個人種目登録!AZ11=\"\",\"\",個人種目登録!AZ11)","v":""},{"$f":"IF(個人種目登録!BH11=\"\",\"\",個人種目登録!BH11)","v":""}]
[{"$f":"IF(個人種目登録!AP12=\"\",\"\",個人種目登録!AP12)","v":""},{"$f":"IF(個人種目登録!AR12=\"\",\"\",個人種目登録!AR12)","v":""},{"$f":"IF(個人種目登録!D12=\"\",\"\",個人種目登録!D12)","v":""},{"$f":"IF(個人種目登録!AO12=\"\",\"\",個人種目登録!AO12)","v":""},{"$f":"IF(個人種目登録!AS12=\"\",\"\",個人種目登録!AS12)","v":""},{"$f":"IF(個人種目登録!AT12=\"\",\"\",個人種目登録!AT12)","v":""},null,null,{"$f":"IF(個人種目登録!AN12=\"\",\"\",個人種目登録!AN12)","v":""},{"$f":"IF(個人種目登録!AV12=\"\",\"\",個人種目登録!AV12)","v":""},{"$f":"IF(個人種目登録!AX12=\"\",\"\",個人種目登録!AX12)","v":""},{"$f":"IF(個人種目登録!AZ12=\"\",\"\",個人種目登録!AZ12)","v":""},{"$f":"IF(個人種目登録!BH12=\"\",\"\",個人種目登録!BH12)","v":""}]
[{"$f":"IF(個人種目登録!AP13=\"\",\"\",個人種目登録!AP13)","v":""},{"$f":"IF(個人種目登録!AR13=\"\",\"\",個人種目登録!AR13)","v":""},{"$f":"IF(個人種目登録!D13=\"\",\"\",個人種目登録!D13)","v":""},{"$f":"IF(個人種目登録!AO13=\"\",\"\",個人種目登録!AO13)","v":""},{"$f":"IF(個人種目登録!AS13=\"\",\"\",個人種目登録!AS13)","v":""},{"$f":"IF(個人種目登録!AT13=\"\",\"\",個人種目登録!AT13)","v":""},null,null,{"$f":"IF(個人種目登録!AN13=\"\",\"\",個人種目登録!AN13)","v":""},{"$f":"IF(個人種目登録!AV13=\"\",\"\",個人種目登録!AV13)","v":""},{"$f":"IF(個人種目登録!AX13=\"\",\"\",個人種目登録!AX13)","v":""},{"$f":"IF(個人種目登録!AZ13=\"\",\"\",個人種目登録!AZ13)","v":""},{"$f":"IF(個人種目登録!BH13=\"\",\"\",個人種目登録!BH13)","v":""}]
[{"$f":"IF(個人種目登録!AP14=\"\",\"\",個人種目登録!AP14)","v":""},{"$f":"IF(個人種目登録!AR14=\"\",\"\",個人種目登録!AR14)","v":""},{"$f":"IF(個人種目登録!D14=\"\",\"\",個人種目登録!D14)","v":""},{"$f":"IF(個人種目登録!AO14=\"\",\"\",個人種目登録!AO14)","v":""},{"$f":"IF(個人種目登録!AS14=\"\",\"\",個人種目登録!AS14)","v":""},{"$f":"IF(個人種目登録!AT14=\"\",\"\",個人種目登録!AT14)","v":""},null,null,{"$f":"IF(個人種目登録!AN14=\"\",\"\",個人種目登録!AN14)","v":""},{"$f":"IF(個人種目登録!AV14=\"\",\"\",個人種目登録!AV14)","v":""},{"$f":"IF(個人種目登録!AX14=\"\",\"\",個人種目登録!AX14)","v":""},{"$f":"IF(個人種目登録!AZ14=\"\",\"\",個人種目登録!AZ14)","v":""},{"$f":"IF(個人種目登録!BH14=\"\",\"\",個人種目登録!BH14)","v":""}]
[{"$f":"IF(個人種目登録!AP15=\"\",\"\",個人種目登録!AP15)","v":""},{"$f":"IF(個人種目登録!AR15=\"\",\"\",個人種目登録!AR15)","v":""},{"$f":"IF(個人種目登録!D15=\"\",\"\",個人種目登録!D15)","v":""},{"$f":"IF(個人種目登録!AO15=\"\",\"\",個人種目登録!AO15)","v":""},{"$f":"IF(個人種目登録!AS15=\"\",\"\",個人種目登録!AS15)","v":""},{"$f":"IF(個人種目登録!AT15=\"\",\"\",個人種目登録!AT15)","v":""},null,null,{"$f":"IF(個人種目登録!AN15=\"\",\"\",個人種目登録!AN15)","v":""},{"$f":"IF(個人種目登録!AV15=\"\",\"\",個人種目登録!AV15)","v":""},{"$f":"IF(個人種目登録!AX15=\"\",\"\",個人種目登録!AX15)","v":""},{"$f":"IF(個人種目登録!AZ15=\"\",\"\",個人種目登録!AZ15)","v":""},{"$f":"IF(個人種目登録!BH15=\"\",\"\",個人種目登録!BH15)","v":""}]
{"$rows_left_out":194}
{"sheet":"ﾘﾚｰﾃﾞｰﾀ取得","index":4,"n_rows":32,"n_cols":20,"rows_kept":32,"cut":false,"hidden":false,"merged":[[1,0,10,0],[15,0,24,0],[29,0,31,0]]}
[null,null,"DB","ZK","KC","N1","N2","TM","KM","LN","S1","S2","S3","S4","S5","S6","S7","S8"]
["男子",1,{"$f":"IF(リレー登録!Y4=\"\",\"\",リレー登録!Y4)","v":""},{"$f":"IF(リレー登録!Z4=\"\",\"\",リレー登録!Z4)","v":""},{"$f":"IF(リレー登録!AA4=\"\",\"\",リレー登録!AA4)","v":""},{"$f":"IF(リレー登録!AB4=\"\",\"\",リレー登録!AB4)","v":""},{"$f":"IF(リレー登録!AC4=\"\",\"\",リレー登録!AC4)","v":""},{"$f":"IF(リレー登録!AD4=\"\",\"\",リレー登録!AD4)","v":""},{"$f":"IF(リレー登録!AE4=\"\",\"\",リレー登録!AE4)","v":""},{"$f":"IF(リレー登録!AF4=\"\",\"\",リレー登録!AF4)","v":""},{"$f":"IF(リレー登録!AG4=\"\",\"\",リレー登録!AG4)","v":""},{"$f":"IF(リレー登録!AH4=\"\",\"\",リレー登録!AH4)","v":""},{"$f":"IF(リレー登録!AI4=\"\",\"\",リレー登録!AI4)","v":""},{"$f":"IF(リレー登録!AJ4=\"\",\"\",リレー登録!AJ4)","v":""},{"$f":"IF(リレー登録!AK4=\"\",\"\",リレー登録!AK4)","v":""},{"$f":"IF(リレー登録!AL4=\"\",\"\",リレー登録!AL4)","v":""},{"$f":"IF(リレー登録!AM4=\"\",\"\",リレー登録!AM4)","v":""},{"$f":"IF(リレー登録!AN4=\"\",\"\",リレー登録!AN4)","v":""},null,{"$f":"1-COUNTIF(C2,\"\")","v":0}]
[null,2,{"$f":"IF(リレー登録!Y6=\"\",\"\",リレー登録!Y6)","v":""},{"$f":"IF(リレー登録!Z6=\"\",\"\",リレー登録!Z6)","v":""},{"$f":"IF(リレー登録!AA6=\"\",\"\",リレー登録!AA6)","v":""},{"$f":"IF(リレー登録!AB6=\"\",\"\",リレー登録!AB6)","v":""},{"$f":"IF(リレー登録!AC6=\"\",\"\",リレー登録!AC6)","v":""},{"$f":"IF(リレー登録!AD6=\"\",\"\",リレー登録!AD6)","v":""},{"$f":"IF(リレー登録!AE6=\"\",\"\",リレー登録!AE6)","v":""},{"$f":"IF(リレー登録!AF6=\"\",\"\",リレー登録!AF6)","v":""},{"$f":"IF(リレー登録!AG6=\"\",\"\",リレー登録!AG6)","v":""},{"$f":"IF(リレー登録!AH6=\"\",\"\",リレー登録!AH6)","v":""},{"$f":"IF(リレー登録!AI6=\"\",\"\",リレー登録!AI6)","v":""},{"$f":"IF(リレー登録!AJ6=\"\",\"\",リレー登録!AJ6)","v":""},{"$f":"IF(リレー登録!AK6=\"\",\"\",リレー登録!AK6)","v":""},{"$f":"IF(リレー登録!AL6=\"\",\"\",リレー登録!AL6)","v":""},{"$f":"IF(リレー登録!AM6=\"\",\"\",リレー登録!AM6)","v":""},{"$f":"IF(リレー登録!AN6=\"\",\"\",リレー登録!AN6)","v":""},null,{"$f":"9-COUNTIF(C3:C11,\"\")","v":0}]
[null,3,{"$f":"IF(リレー登録!Y8=\"\",\"\",リレー登録!Y8)","v":""},{"$f":"IF(リレー登録!Z8=\"\",\"\",リレー登録!Z8)","v":""},{"$f":"IF(リレー登録!AA8=\"\",\"\",リレー登録!AA8)","v":""},{"$f":"IF(リレー登録!AB8=\"\",\"\",リレー登録!AB8)","v":""},{"$f":"IF(リレー登録!AC8=\"\",\"\",リレー登録!AC8)","v":""},{"$f":"IF(リレー登録!AD8=\"\",\"\",リレー登録!AD8)","v":""},{"$f":"IF(リレー登録!AE8=\"\",\"\",リレー登録!AE8)","v":""},{"$f":"IF(リレー登録!AF8=\"\",\"\",リレー登録!AF8)","v":""},{"$f":"IF(リレー登録!AG8=\"\",\"\",リレー登録!AG8)","v":""},{"$f":"IF(リレー登録!AH8=\"\",\"\",リレー登録!AH8)","v":""},{"$f":"IF(リレー登録!AI8=\"\",\"\",リレー登録!AI8)","v":""},{"$f":"IF(リレー登録!AJ8=\"\",\"\",リレー登録!AJ8)","v":""},{"$f":"IF(リレー登録!AK8=\"\",\"\",リレー登録!AK8)","v":""},{"$f":"IF(リレー登録!AL8=\"\",\"\",リレー登録!AL8)","v":""},{"$f":"IF(リレー登録!AM8=\"\",\"\",リレー登録!AM8)","v":""},{"$f":"IF(リレー登録!AN8=\"\",\"\",リレー登録!AN8)","v":""}]
[null,4,{"$f":"IF(リレー登録!Y10=\"\",\"\",リレー登録!Y10)","v":""},{"$f":"IF(リレー登録!Z10=\"\",\"\",リレー登録!Z10)","v":""},{"$f":"IF(リレー登録!AA10=\"\",\"\",リレー登録!AA10)","v":""},{"$f":"IF(リレー登録!AB10=\"\",\"\",リレー登録!AB10)","v":""},{"$f":"IF(リレー登録!AC10=\"\",\"\",リレー登録!AC10)","v":""},{"$f":"IF(リレー登録!AD10=\"\",\"\",リレー登録!AD10)","v":""},{"$f":"IF(リレー登録!AE10=\"\",\"\",リレー登録!AE10)","v":""},{"$f":"IF(リレー登録!AF10=\"\",\"\",リレー登録!AF10)","v":""},{"$f":"IF(リレー登録!AG10=\"\",\"\",リレー登録!AG10)","v":""},{"$f":"IF(リレー登録!AH10=\"\",\"\",リレー登録!AH10)","v":""},{"$f":"IF(リレー登録!AI10=\"\",\"\",リレー登録!AI10)","v":""},{"$f":"IF(リレー登録!AJ10=\"\",\"\",リレー登録!AJ10)","v":""},{"$f":"IF(リレー登録!AK10=\"\",\"\",リレー登録!AK10)","v":""},{"$f":"IF(リレー登録!AL10=\"\",\"\",リレー登録!AL10)","v":""},{"$f":"IF(リレー登録!AM10=\"\",\"\",リレー登録!AM10)","v":""},{"$f":"IF(リレー登録!AN10=\"\",\"\",リレー登録!AN10)","v":""}]
[null,5,{"$f":"IF(リレー登録!Y12=\"\",\"\",リレー登録!Y12)","v":""},{"$f":"IF(リレー登録!Z12=\"\",\"\",リレー登録!Z12)","v":""},{"$f":"IF(リレー登録!AA12=\"\",\"\",リレー登録!AA12)","v":""},{"$f":"IF(リレー登録!AB12=\"\",\"\",リレー登録!AB12)","v":""},{"$f":"IF(リレー登録!AC12=\"\",\"\",リレー登録!AC12)","v":""},{"$f":"IF(リレー登録!AD12=\"\",\"\",リレー登録!AD12)","v":""},{"$f":"IF(リレー登録!AE12=\"\",\"\",リレー登録!AE12)","v":""},{"$f":"IF(リレー登録!AF12=\"\",\"\",リレー登録!AF12)","v":""},{"$f":"IF(リレー登録!AG12=\"\",\"\",リレー登録!AG12)","v":""},{"$f":"IF(リレー登録!AH12=\"\",\"\",リレー登録!AH12)","v":""},{"$f":"IF(リレー登録!AI12=\"\",\"\",リレー登録!AI12)","v":""},{"$f":"IF(リレー登録!AJ12=\"\",\"\",リレー登録!AJ12)","v":""},{"$f":"IF(リレー登録!AK12=\"\",\"\",リレー登録!AK12)","v":""},{"$f":"IF(リレー登録!AL12=\"\",\"\",リレー登録!AL12)","v":""},{"$f":"IF(リレー登録!AM12=\"\",\"\",リレー登録!AM12)","v":""},{"$f":"IF(リレー登録!AN12=\"\",\"\",リレー登録!AN12)","v":""}]
[null,6,{"$f":"IF(リレー登録!Y14=\"\",\"\",リレー登録!Y14)","v":""},{"$f":"IF(リレー登録!Z14=\"\",\"\",リレー登録!Z14)","v":""},{"$f":"IF(リレー登録!AA14=\"\",\"\",リレー登録!AA14)","v":""},{"$f":"IF(リレー登録!AB14=\"\",\"\",リレー登録!AB14)","v":""},{"$f":"IF(リレー登録!AC14=\"\",\"\",リレー登録!AC14)","v":""},{"$f":"IF(リレー登録!AD14=\"\",\"\",リレー登録!AD14)","v":""},{"$f":"IF(リレー登録!AE14=\"\",\"\",リレー登録!AE14)","v":""},{"$f":"IF(リレー登録!AF14=\"\",\"\",リレー登録!AF14)","v":""},{"$f":"IF(リレー登録!AG14=\"\",\"\",リレー登録!AG14)","v":""},{"$f":"IF(リレー登録!AH14=\"\",\"\",リレー登録!AH14)","v":""},{"$f":"IF(リレー登録!AI14=\"\",\"\",リレー登録!AI14)","v":""},{"$f":"IF(リレー登録!AJ14=\"\",\"\",リレー登録!AJ14)","v":""},{"$f":"IF(リレー登録!AK14=\"\",\"\",リレー登録!AK14)","v":""},{"$f":"IF(リレー登録!AL14=\"\",\"\",リレー登録!AL14)","v":""},{"$f":"IF(リレー登録!AM14=\"\",\"\",リレー登録!AM14)","v":""},{"$f":"IF(リレー登録!AN14=\"\",\"\",リレー登録!AN14)","v":""}]
[null,7,{"$f":"IF(リレー登録!Y16=\"\",\"\",リレー登録!Y16)","v":""},{"$f":"IF(リレー登録!Z16=\"\",\"\",リレー登録!Z16)","v":""},{"$f":"IF(リレー登録!AA16=\"\",\"\",リレー登録!AA16)","v":""},{"$f":"IF(リレー登録!AB16=\"\",\"\",リレー登録!AB16)","v":""},{"$f":"IF(リレー登録!AC16=\"\",\"\",リレー登録!AC16)","v":""},{"$f":"IF(リレー登録!AD16=\"\",\"\",リレー登録!AD16)","v":""},{"$f":"IF(リレー登録!AE16=\"\",\"\",リレー登録!AE16)","v":""},{"$f":"IF(リレー登録!AF16=\"\",\"\",リレー登録!AF16)","v":""},{"$f":"IF(リレー登録!AG16=\"\",\"\",リレー登録!AG16)","v":""},{"$f":"IF(リレー登録!AH16=\"\",\"\",リレー登録!AH16)","v":""},{"$f":"IF(リレー登録!AI16=\"\",\"\",リレー登録!AI16)","v":""},{"$f":"IF(リレー登録!AJ16=\"\",\"\",リレー登録!AJ16)","v":""},{"$f":"IF(リレー登録!AK16=\"\",\"\",リレー登録!AK16)","v":""},{"$f":"IF(リレー登録!AL16=\"\",\"\",リレー登録!AL16)","v":""},{"$f":"IF(リレー登録!AM16=\"\",\"\",リレー登録!AM16)","v":""},{"$f":"IF(リレー登録!AN16=\"\",\"\",リレー登録!AN16)","v":""}]
{"$rows_left_out":25}
{"sheet":"所属データ","index":5,"n_rows":33,"n_cols":8,"rows_kept":33,"cut":false,"hidden":false,"merged":[]}
["群馬県内クラブ一覧表"]
["郡市名","№","学校コード\n申し込みには\nこのｺｰﾄﾞを入力","コード","学校名","略称","ﾖﾐｶﾞﾅ"]
[50,1,{"$f":"IF(B3<10,CONCATENATE($A$3,\"0\",B3)*1,CONCATENATE($A$3,B3)*1)","v":5001},105001,"群馬陸上競技協会","群馬陸協","群馬陸協",{"$f":"C3","v":5001}]
["クラブ",2,{"$f":"IF(B4<10,CONCATENATE($A$3,\"0\",B4)*1,CONCATENATE($A$3,B4)*1)","v":5002},105002,"高崎市陸上競技協会","高崎市陸協","高崎市陸協",{"$f":"C4","v":5002}]
[null,3,5003,105003,"吾妻榛嶺ｸﾗﾌﾞ","吾妻榛嶺ｸﾗﾌﾞ","吾妻榛嶺ｸﾗﾌﾞ",5003]
[null,4,5004,105004,"碓氷陸上競技ｸﾗﾌﾞ","碓氷ｸﾗﾌﾞ","碓氷ｸﾗﾌﾞ",5004]
[null,5,5005,105005,"館林陸上競技ｸﾗﾌﾞ","館林ｸﾗﾌﾞ","館林ｸﾗﾌﾞ",5005]
[null,6,5006,105006,"渋川陸上競技ｸﾗﾌﾞ","渋川ｸﾗﾌﾞ","渋川ｸﾗﾌﾞ",5006]
{"$rows_left_out":26}
{"sheet":"基礎データ","index":6,"n_rows":33,"n_cols":17,"rows_kept":33,"cut":false,"hidden":false,"merged":[]}
[]
[null,"クラブ","ｸﾗﾌﾞｺｰﾄﾞ(KC)",null,"学年","学年ｺｰﾄﾞ",null,"性別","性別ｺｰﾄﾞ",null,"種目","種目ｺｰﾄﾞ"]
[null,"群馬陸上競技協会",10,null,1,"01","小1","男",1,null,"５０ｍ","R421",null,"園","５０ｍ","５００ｍ","幅跳び"]
[null,"高崎市陸上競技協会",20,null,2,"02","小2","女",2,null,"１００ｍ","R002",null,1,"５０ｍ","５００ｍ","幅跳び"]
[null,"吾妻榛嶺ｸﾗﾌﾞ",30,null,3,"03","小3",null,null,null,"８００ｍ","R006",null,2,"５０ｍ","５００ｍ","幅跳び"]
[null,"碓氷陸上競技ｸﾗﾌﾞ",40,null,4,"04","小4",null,null,null,"小ｺﾝﾊﾞｲﾝﾄﾞA総合得点(全国ﾙｰﾙ)","R215",null,3,"１００ｍ","８００ｍ","幅跳び"]
[null,"館林陸上競技ｸﾗﾌﾞ",50,null,5,"05","小5",null,null,null,"小ｺﾝﾊﾞｲﾝﾄﾞB総合得点(全国ﾙｰﾙ)","R220",null,4,"１００ｍ","８００ｍ","幅跳び"]
[null,"渋川陸上競技ｸﾗﾌﾞ",60,null,6,"06","小6",null,null,null,"４×１００ｍ","R601",null,5,"１００ｍ","８００ｍ","走幅跳"]
{"$rows_left_out":26}
{"sheet":"競技データ","index":7,"n_rows":400,"n_cols":3,"rows_kept":400,"cut":false,"hidden":false,"merged":[]}
["コード","種目名"]
["421   101","５０ｍ男子1年",{"$f":"\"R\"&LEFT(A2,3)&RIGHT(A2,2)","v":"R42101"}]
["421   102","５０ｍ男子2年",{"$f":"\"R\"&LEFT(A3,3)&RIGHT(A3,2)","v":"R42102"}]
["002   103","１００ｍ男子3年","R00203"]
["002   104","１００ｍ男子4年","R00204"]
["006   103","８００ｍ男子3年","R00603"]
["006   104","８００ｍ男子4年","R00604"]
["006   105","８００ｍ男子5年","R00605"]
{"$rows_left_out":393}
{"sheet":"処理用","index":8,"n_rows":0,"n_cols":0,"rows_kept":0,"cut":false,"hidden":true,"merged":[]}