{"text_format":"1","workbook":"xlsx","n_sheets":7,"sheets":["メニュー","開催申請書","競技会","競技場","大学名","Competition","2012"],"not_rendered":{"charts":0,"images":0,"macros":1,"external_links":0,"defined_names":0,"comments":0,"pivot_tables":0},"unopened":[],"bounds":{"document_bytes":16777216,"sheet_cells":100000,"rows_first":2000,"rows_last":500,"rows_between":2000,"halvings":0,"cell_chars":16384,"cell_head_chars":4096},"cells_cut":0,"cells_raw":0,"read":"whole","date_system":"1900"}

{"sheet":"メニュー","index":0,"n_rows":15,"n_cols":10,"rows_kept":15,"cut":false,"hidden":false,"merged":[[9,9,10,9],[9,8,10,8],[9,7,10,7],[9,6,10,6],[1,1,1,11]]}
[]
[null,"平成25年度　日本学生陸上競技連合公認競技会申請メニュー（加盟校用）"]
[]
[null,"1.大学情報登録"]
[null,"地区・大学名・部長氏名を登録してください。"]
[]
[null,"2.競技会登録"]
[null,"開催競技会を登録してください。"]
[]
[null,"3.申請日の入力",null,null,null,null,null,"月",null,"日"]
[null,"公認競技会申請日を入力してください。"]
[]
[null,"4.入力の終了"]
[null,"内容を保存し、終了してください。自動的にファイル名を"]
[null,"つけてExcelファイルを閉じます。"]

{"sheet":"開催申請書","index":1,"n_rows":62,"n_cols":19,"rows_kept":62,"cut":false,"hidden":false,"merged":[[0,0,0,18],[11,7,11,8],[3,2,3,5],[9,2,9,6]]}
["2013年度　公認競技会開催申請書"]
[null,null,null,null,null,null,null,null,null,null,null,null,null,null,null,null,null,null,{"$f":"\"平成２５年\" & DBCS(メニュー!G10) & \"月\" & DBCS(メニュー!I10) & \"日\"","v":"平成２５年月日"}]
[null,"","学生陸上競技連盟"]
[null,"会長",null,null,null,null,"様"]
[]
[null,"下記の通り、公認競技会の開催を申請します。"]
[]
[null,"陸上競技部　"]
[]
[null,"部長",null,null,null,null,null," ㊞"]
[]
["No.","種別","月","日","～","月","日","　競技会",null,"競技場コード","会　場","担当者氏名","所属","電話番号","E-mail","郵便番号","住所","備考","変更前競技会"]
[1]
[2]
[3]
[4]
[5]
[6]
[7]
[8]
[9]
[10]
[11]
[12]
[13]
[14]
[15]
[16]
[17]
[18]
[19]
[20]
[21]
[22]
[23]
[24]
[25]
[26]
[27]
[28]
{"$rows_left_out":23}
{"sheet":"競技会","index":2,"n_rows":88,"n_cols":10,"rows_kept":88,"cut":false,"hidden":false,"merged":[]}
[10,8,12,87,12,17,37,25,21,37]
["天皇賜盃日本学生陸上競技対校選手権大会","北海道学生陸上競技対校選手権大会","東北学生陸上競技対校選手権大会","関東学生陸上競技対校選手権大会","北信越学生陸上競技対校選手権大会","東海学生陸上競技対校選手権大会","関西学生陸上競技対校選手権大会","中国四国学生陸上競技対校選手権大会","九州学生陸上競技対校選手権大会","秩父宮賜杯西日本学生陸上競技対校選手権大会"]
["日本学生陸上競技個人選手権大会","北海道知事杯北海道大学駅伝対校選手権大会","東北学生駅伝対校選手権大会","東京箱根間往復大学駅伝競走","北信越学生10マイルロードレース大会","東海学生駅伝対校選手権大会","関西学生対校駅伝競走大会","中国四国学生陸上競技選手権大会","九州学生陸上競技選手権大会","北日本学生陸上競技対校選手権大会"]
["出雲全日本大学選抜駅伝競走","北海道教育長杯北海道大学女子駅伝対校選手権大会","東北学生陸上競技選手権大会","東京箱根間往復大学駅伝競走予選会","北信越学生女子5ｋｍロードレース選手権大会","東海学生女子駅伝対校選手権大会","関西学生対校女子駅伝競走大会","中国四国学生駅伝競走大会","九州学生駅伝対校選手権大会　兼　島原・雲仙駅伝","北海道大学対東北大学陸上競技定期戦"]
["秩父宮賜杯全日本大学駅伝対校選手権大会","北海道学生陸上競技選手権大会","東北学連春季競技会","関東大学女子駅伝対校選手権大会","北信越学生陸上競技選手権大会","東海学生陸上競技秋季選手権大会","関西学生陸上競技学年別選手権大会","中国四国学生女子駅伝競走大会","全日本大学駅伝・全日本大学女子駅伝九州地区予選会","青山学院大学対東北学院大学陸上競技定期戦"]
["全日本大学女子駅伝対校選手権大会","北海道学連競技会","東北学連ナイター競技会","関東学生新人陸上競技選手権大会","金沢星稜大学競技会","全日本大学駅伝対校選手権大会東海地区選考会","関西学生混成選手権大会","全日本大学駅伝対校選手権大会中国四国地区最終選考会","学連競技会","全日本医歯薬獣医大学対抗陸上競技選手権大会"]
["全日本大学女子選抜駅伝競走","北海道学連中長競技会","全日本大学駅伝対校選手権大会東北地区予選会兼全日本大学女子駅伝対校選手権大会","トワイライト・ゲームス","新潟県学生陸上競技連盟競技会","全日本大学女子駅伝対校選手権大会東海地区選考会","関西学生対校駅伝競走大会予選会","四国地区大学総合体育大会","鹿屋体育大学春季競技会","同志社大学対立教大学定期陸上競技戦"]
["日本学生ハーフマラソン選手権大会","北海道地区大学体育大会（陸上競技）","仙台大学競技会","全日本大学駅伝関東学連推薦校選考会","北陸地区国立大学体育会","東海学生陸上競技春季大会","全日本大学駅伝対校選手権大会関西学連予選会","中国四国私立大学対校陸上競技選手権大会","鹿屋体育大学短距離競技会","同志社大学対立教大学女子対抗陸上競技大会"]
["日本学生女子ハーフマラソン選手権大会","スプリントトライアスロン","東北福祉大学競技会","関東学連春季オープン競技会","上越教育大学陸上競技会","東海学生陸上競技夏季大会","学連競技会","岡山学生陸上競技選手権大会","鹿屋体育大学強化競技会","三大学対校陸上競技大会（大阪市大・神戸大・一橋大）"]
["日本学生20km競歩選手権大会",null,"山形大学陸上競技部競技会","関東学連秋季オープン競技会","オータムカップ　in　新潟","土曜競技会","京都学生陸上競技対校選手権大会　　　　　　　　　　","広島県実業団・学生対抗陸上競技選手権大会","九州学連南九州地区学連競技会","国公立22大学対校陸上競技大会（茨大・宇大・群大・埼大・静大・首都大・信州大・高経大・千大・都留文大・電通大・東学大・東工大・東北大・新潟大・一橋大・福島大・三重大・山形大・山梨大・横市大・横国大）"]
["秩父宮賜杯実業団・学生対抗陸上競技大会",null,"東北地区大学総合体育大会陸上競技","10000m記録挑戦競技会","新潟医療福祉大学競技会","愛知六大学対校陸上競技大会（愛知大・愛知学大・愛教大・名大・南山大・名城大）","大阪学生陸上競技対校選手権大会","岡山県学生対実業団対抗陸上競技選手権大会","鹿屋体育大学陸上競技会","六大学対校陸上競技大会（東海大・筑波大・順大・日体大・日大・中京大）"]
[null,null,"岩手大学陸上競技部競技会","二大学対校陸上競技会（茨大・千大）","全日本大学駅伝対校選手権大会北信越予選会","東海地区国立大学陸上競技会","兵庫学生陸上競技対校選手権大会","四国地区高等専門学校対校陸上競技大会","鹿屋体育大学長距離競技会","関西大学対法政大学対校陸上競技定期戦"]
[null,null,"東北学連競技会","群馬大学競技会","全日本大学女子駅伝対校選手権大会北信越予選会","静岡県大学生選手権大会","兵庫学生陸上競技女子選手権大会","岡山県学連競技会","九州地区大学体育大会","東京大学・京都大学対校陸上競技大会"]
[null,null,null,"関東私学六大学対校陸上競技大会（國学大・上智大・成蹊大・東経大・明学大・立大）",null,"至学館大学陸上競技大会","京都学生駅伝競走大会","広島県学連競技会","福大競技会","東京大学・京都大学対校女子陸上競技大会"]
[null,null,null,"国士舘大学競技会",null,"ハンマー投チャレンジカップ","大阪体育大学競技会","広島大学春季競技会","大分地区大学・高等専門学校陸上競技会","早稲田大学・関西学院大学対校陸上競技大会"]
[null,null,null,"国士舘大学長距離競技会",null,"東海学生陸上競技記録会","大阪三大学対校陸上競技大会（大阪市大・大阪府大・阪大）","広島大学夏季競技会","九州共立大学チャレンジ陸上","大学対校混成競技会"]
[null,null,null,"国際武道大学競技会",null,"岐阜経済大学陸上競技会","総合関関戦陸上競技大会","高知大学春季競技会","九州共立大学投てき競技会","国公立22大学対校駅伝大会（茨大・宇大・群大・埼大・静大・首都大・信州大・高経大・千大・都留文大・電通大・東学大・東工大・東北大・新潟大・一橋大・福島大・三重大・山形大・山梨大・横市大・横国大）"]
[null,null,null,"国際武道大学秋季合同競技会",null,"梅村学園陸上競技大会","関西私立四大学対校陸上競技大会（関学大・関大・立命大・同大）","高知大学秋季競技会","全日本大学女子駅伝九州地区予選会","信州大学・名古屋大学対校陸上競技大会"]
[null,null,null,"国際武道大学選手権",null,null,"関西私立四大学陸上競技女子競技会（関学大・関大・立命大・同大）","春季島大リレーカーニバル","名桜大学陸上競技会","一橋大学・名古屋大学対校陸上競技大会"]
[null,null,null,"国際武道大学フィールド競技会",null,null,"同志社大学対京都大学陸上競技大会","秋季島大リレーカーニバル","北九州・下関地区大学体育大会(陸上競技)","一橋大学・名古屋大学女子対校陸上競技大会"]
[null,null,null,"北関東5大学対校陸上競技大会（茨大・宇大・群大・埼大・高経大）",null,null,"近畿地区国立大学体育大会","山口支部競技会","ＮＩＦＳ競技会","慶応義塾大学・同志社大学対校陸上競技大会"]
[null,null,null,"関東私学四大学対校陸上競技大会（上智大、成蹊大、獨協大、明学大）",null,null,"関西医科学生対校陸上競技選手権大会","中国五大学対校陸上競技大会（岡山大・島根大・鳥取大・広島大・山口大）","九州共立大学競技会","大阪大学・名古屋大学対校陸上競技大会"]
[null,null,null,"早大競技会",null,null,"兵庫三大学対校陸上競技大会（神戸学大・甲南大・流科大）","愛媛女子短期大学競技会",null,"秩父宮賜杯学習院大学・甲南大学対校陸上競技大会"]
[null,null,null,"東京六大学対校陸上競技大会（慶大・東大・法大・明大・立大・早大）",null,null,"阪神四大学対校陸上競技大会（神戸大・阪大・甲南大・関学大）","徳山大学フィールド記録会",null,"学習院大学・甲南大学対校陸上競技大会（女子の部）"]
[null,null,null,"中大競技会",null,null,"関西学生長距離強化競技会","徳山大学ナイター記録会",null,"全国教育系大学陸上競技大会"]
[null,null,null,"中大長距離競技会",null,null,"天理大学・大阪体育大学陸上競技対校選手権大会","徳山大学スプリングフェスティバル",null,"西日本七大学陸上競技対校選手権大会（神戸大・滋賀大・山口大・香川大・大阪市大・兵庫県大・和大）"]
[null,null,null,"筑波大競技会",null,null,"京阪神三大学対校新人陸上競技大会（京大学・阪大・神戸大）",null,null,"大阪経済大学対東京経済大学定期対校戦"]
[null,null,null,"筑波大投擲競技会",null,null,"京阪神三大学対校女子陸上競技大会（京大・阪大・神戸大）",null,null,"九州・山口医科学生体育大会"]
[null,null,null,"筑波大ポストシーズン競技会",null,null,"関西大学競技会",null,null,"全国七大学対校女子陸上競技大会（北大・東北大・東大・名大・京大・阪大・九大）"]
[null,null,null,"長距離競技会",null,null,"びわこ成蹊スポーツ大学競技会",null,null,"全国七大学対校陸上競技大会（北大・東北大・東大・名大・京大・阪大・九大）"]
[null,null,null,"13大学対校陸上競技大会（工学院大・首都大・帝京大・電通大・東外大・東工大・東電大・東農工大・東京薬大・東理大・文教大・武蔵工大・横市大）",null,null,"桃山学院大学・摂南大学対校陸上競技大会",null,null,"西日本医科学生総合体育大会"]
[null,null,null,"四大学対校陸上競技大会（国士大・順大・東海大・日女体大・日体大）",null,null,"大阪体育大学中長距離競技会",null,null,"関西医歯薬科学生対校陸上競技大会"]
[null,null,null,"関東七大学対校陸上競技大会（学習院大・北里大・成城大・獨協大・東邦大・文教大・明学大）",null,null,"学連長距離ロード競技会",null,null,"関東甲信越大学体育大会"]
[null,null,null,"四大学対校陸上競技大会（学習院大・成蹊大・成城大・武蔵大）",null,null,"関西学院大学競技会",null,null,"四大学対校女子陸上競技選手権大会（国士大・中京大・中京女大・日体大）"]
[null,null,null,"学園スポーツ大会",null,null,"大阪体育大学混成競技会",null,null,"全関東甲信越薬学生陸上競技大会"]
[null,null,null,"東海大学競技会",null,null,"関西薬学生対校陸上競技大会",null,null,"山口大・北九州大合同競技会"]
[null,null,null,"東海大学種目別競技会",null,null,"甲南大学競技会",null,null,"大阪府立・首都大対校"]
[null,null,null,"国立4大学陸上競技大会（群大・埼大・東大・東学大）",null,null,"京都産業大学長距離競技会",null,null,"大阪大学・名古屋大学対校女子陸上競技大会"]
[null,null,null,"国立4大学女子陸上競技大会（群大・埼大・東大・東学大）"]
[null,null,null,"東京大学陸上競技会"]
{"$rows_left_out":49}
{"sheet":"競技場","index":3,"n_rows":385,"n_cols":3,"rows_kept":385,"cut":false,"hidden":false,"merged":[]}
["競技場コード","正式名称","385"]
["011010","札幌市厚別公園競技場"]
["012010","札幌市円山競技場"]
["012040","函館市千代台公園陸上競技場"]
["012080","花咲スポーツ公園陸上競技場"]
["012100","帯広の森陸上競技場"]
["012110","釧路市民陸上競技場"]
["012120","室蘭市入江運動公園陸上競技場"]
["013020","北見市東陵公園陸上競技場"]
["013080","青葉公園陸上競技場"]
["013130","士別市営陸上競技場"]
["013170","網走市運動公園陸上競技場"]
["013360","深川市陸上競技場"]
["013380","岩見沢市東山公園陸上競技場"]
["013410","芦別市陸上競技場"]
["013420","小樽市手宮公園陸上競技場"]
["021010","青森県総合運動公園陸上競技場"]
["022010","弘前市運動公園陸上競技場"]
["022040","むつ運動公園陸上競技場"]
["023080","六ヶ所村大石総合運動公園陸上競技場"]
["023110","八戸市東運動公園陸上競技場"]
["023130","中里町運動公園陸上競技場"]
["023150","東北町北総合運動公園陸上競技場"]
["023170","八戸市南郷陸上競技場"]
["023180","六戸町総合運動公園陸上競技場"]
["031010","県営運動公園陸上競技場"]
["031020","北上陸上競技場"]
["032010","一関運動公園陸上競技場"]
["033170","森山総合公園陸上競技場"]
["033190","北上陸上補助競技場"]
["033210","ふれあいらんど岩泉陸上競技場"]
["035050","日居城野陸上競技場"]
["035090","ふれあいらんど岩手陸上競技場"]
["041020","宮城スタジアム"]
["043050","仙台大学陸上競技場"]
["043080","岩沼市陸上競技場"]
["043090","栗原市築館総合運動公園陸上競技場"]
["043100","女川町町民陸上競技場"]
["043110","角田市陸上競技場"]
["043130","東北電力(株)名取スポーツパーク愛島競技場"]
{"$rows_left_out":346}
{"sheet":"大学名","index":4,"n_rows":8,"n_cols":119,"rows_kept":8,"cut":false,"hidden":true,"merged":[]}
[25,"旭川医科大学","旭川工業高等専門学校","小樽商科大学","帯広畜産大学","北見工業大学","札幌医科大学","札幌学院大学","札幌国際大学","札幌大学","東海大学北海道","東京農業大学生物産業学部","函館工業高等専門学校","藤女子大学","北翔大学","北星学園大学","北海学園大学","北海商科大学","北海道医療大学","北海道教育大学","北海道工業大学","北海道大学","北海道文教大学","北海道武蔵女子短期大学","室蘭工業大学","酪農学園大学"]
[31,"会津大学","青森県立保健大学","青森公立大学","青森大学","秋田県立大学","秋田大学","石巻専修大学","いわき明星大学","岩手県立大学","岩手大学","北里大学獣医学部","仙台大学","東北学院大学","東北工業大学","東北大学","東北福祉大学","東北文化学園大学","日本大学工学部","ノースアジア大学","八戸大学","弘前大学","福島県立医科大学","福島工業高等専門学校","福島大学","富士大学","宮城学院女子大学","宮城教育大学","宮城大学","盛岡大学","山形県立米沢女子短期大学","山形大学"]
[118,"青山学院大学","亜細亜大学","茨城大学","宇都宮大学","桜美林大学","お茶の水女子大学","学習院女子大学","学習院大学","神奈川工科大学","神奈川大学","鎌倉女子大学","関東学院大学","関東学園大学","北里大学","群馬大学","敬愛大学","慶應義塾大学","工学院大学","國學院大學","国際武道大学","国士舘大学","駒澤大学","埼玉医科大学","埼玉大学","相模女子大学","作新学院大学","サレジオ工業高等専門学校","芝浦工業大学","首都大学東京","順天堂大学","松蔭大学","城西国際大学","城西大学","上智大学","尚美学園大学","上武大学","昭和大学","昭和薬科大学","駿河台大学","聖学院大学","成蹊大学","成城大学","聖徳大学","清和大学","専修大学","創価大学","創造学園大学","大正大学","大東文化大学","高崎経済大学","拓殖大学","玉川大学","千葉工業大学","千葉商科大学","千葉大学","中央学院大学","中央大学","筑波大学","津田塾大学","都留文科大学","帝京大学","帝京平成大学","電気通信大学","桐蔭横浜大学","東海大学","東京医科歯科大学","東京外国語大学","東京海洋大学","東京学芸大学","東京経済大学","東京工科大学","東京工業大学","東京工芸大学","東京国際大学","東京情報大学","東京女子体育大学","東京大学","東京電機大学","東京都市大学","東京農業大学","東京農工大学","東京福祉大学","東京薬科大学","東京理科大学","東邦大学","東洋大学","獨協大学","日本工業大学","日本体育大学","日本女子体育大学","日本女子大学","日本大学","白?大学","一橋大学","文教大学","平成国際大学","防衛医科大学校","防衛大学校","法政大学","武蔵丘短期大学","武蔵大学","武蔵野学院大学","明海大学","明治学院大学","明治大学","明治薬科大学","明星大学","山梨英和大学","山梨学院大学","山梨大学","横浜市立大学","横浜国立大学","立教大学","立正大学","流通経済大学","麗澤大学","和光大学","早稲田大学"]
[29,"石川県立大学","石川工業高等専門学校","金沢医科大学","金沢学院大学","金沢工業大学","金沢星稜大学","金沢大学","金城大学","小松短期大学","上越教育大学","仁愛女子短期大学","仁愛大学","信州大学","諏訪東京理科大学","富山高等専門学校","富山大学","長岡技術科学大学","長岡工業高等専門学校","長野工業高等専門学校","新潟医療福祉大学","新潟県立大学","新潟国際情報大学","新潟大学","新潟薬科大学","福井県立大学","福井工業大学","福井大学","松本歯科大学","松本大学"]
[43,"愛知医科大学","愛知学院大学","愛知教育大学","愛知県立大学","愛知工業大学","愛知淑徳大学","愛知大学","愛知東邦大学","朝日大学","岐阜経済大学","岐阜工業高等専門学校","岐阜聖徳学園大学","岐阜大学","近畿大学工業高等専門学校","金城学院大学","皇學館大学","至学館大学","静岡産業大学","静岡大学","椙山女学園大学","鈴鹿工業高等専門学校","大同大学","中京大学","中部学院大学","中部大学","東海学園大学","東海大学海洋","常葉学園大学","豊田工業高等専門学校","豊橋技術科学大学","名古屋外国語大学","名古屋学院大学","名古屋工業大学","名古屋商科大学","名古屋市立大学","名古屋大学","南山大学","日本福祉大学","浜松大学","富士常葉大学","三重大学","三重中京大学","名城大学"]
[75,"追手門学院大学","大阪医科大学","大阪大谷大学","大阪学院大学","大阪教育大学","大阪経済大学","大阪経済法科大学","大阪芸術大学","大阪工業大学","大阪国際大学","大阪産業大学","大阪商業大学","大阪市立大学","大阪成蹊大学","大阪体育大学","大阪大学","大阪電気通信大学","大阪人間科学大学","大阪府立大学","大谷大学","関西医科大学","関西外国語大学","関西大学","関西学院大学","京都外国語大学","京都学園大学","京都教育大学","京都光華女子大学","京都工芸繊維大学","京都産業大学","京都女子大学","京都大学","京都府立医科大学","京都府立大学","京都薬科大学","近畿医療福祉大学","近畿大学","甲南大学","神戸学院大学","神戸国際大学","神戸女子大学","神戸大学","神戸薬科大学","滋賀医科大学","滋賀県立大学","滋賀大学","四天王寺大学","摂南大学","園田学園女子大学","太成学院大学","帝塚山大学","天理大学","同志社女子大学","同志社大学","奈良教育大学","奈良県立医科大学","奈良産業大学","奈良女子大学","奈良大学","奈良文化女子短期大学","阪南大学","東大阪大学","兵庫教育大学","兵庫県立大学","兵庫大学","びわこ学院大学","びわこ成蹊スポーツ大学","佛教大学","武庫川女子大学","明治国際医療大学","桃山学院大学","立命館大学","龍谷大学","流通科学大学","和歌山大学"]
[57,"阿南工業高等専門学校","宇部フロンティア大学","愛媛大学","大島商船高等専門学校","岡山県立大学","岡山商科大学","岡山大学","岡山理科大学","尾道市立大学","海上保安大学校","香川大学","川崎医科大学","川崎医療短期大学","川崎医療福祉大学","環太平洋大学","吉備国際大学","近畿大学工学部","倉敷芸術科学大学","呉工業高等専門学校","県立広島大学","高知県立大学","高知工科大学","高知大学","四国学院大学","四国大学","島根県立大学","島根大学","下関市立大学","就実大学","水産大学校","高松大学","津山工業高等専門学校","東亜大学","徳島大学","徳島文理大学","徳山工業高等専門学校","徳山大学","鳥取大学","鳴門教育大学","ノートルダム清心女子大学","広島経済大学","広島工業大学","広島国際大学","広島修道大学","広島商船高等専門学校","広島市立大学","広島大学","福山大学","福山平成大学","松江工業高等専門学校","松山大学","美作大学","山口県立大学","山口大学","山口福祉文化大学","弓削商船高等専門学校","米子工業高等専門学校"]
[53,"有明工業高等専門学校","大分工業高等専門学校","大分大学","沖縄国際大学","沖縄大学","鹿児島工業高等専門学校","鹿児島国際大学","鹿児島大学","鹿屋体育大学","北九州市立大学","北九州工業高等専門学校","九州共立大学","九州工業大学","九州国際大学","九州産業大学","九州歯科大学","九州情報大学","九州大学","九州保健福祉大学","近畿大学産業理工学部","熊本学園大学","熊本高等専門学校","熊本大学","久留米工業高等専門学校","久留米工業大学","久留米大学","佐賀大学","佐世保工業高等専門学校","産業医科大学","志學館大学","西南学院大学","西南女学院大学","崇城大学","第一工業大学","東海大学九州","長崎県立大学","長崎国際大学","長崎純心大学","長崎大学","西九州大学","西日本工業大学","日本経済大学","日本文理大学","福岡教育大学","福岡工業大学","福岡大学","都城工業高等専門学校","宮崎公立大学","宮崎産業経営大学","宮崎大学","名桜大学","立命館アジア太平洋大学","琉球大学"]

{"sheet":"Competition","index":5,"n_rows":124,"n_cols":1,"rows_kept":124,"cut":false,"hidden":true,"merged":[]}
["関東学生陸上競技対校選手権大会"]
["東京箱根間往復大学駅伝競走"]
["東京箱根間往復大学駅伝競走予選会"]
["関東大学女子駅伝対校選手権大会"]
["関東学生新人陸上競技選手権大会"]
["トワイライト・ゲームス"]
["全日本大学駅伝関東学連推薦校選考会"]
["関東学連春季オープン競技会"]
["関東学連秋季オープン競技会"]
["10000m記録挑戦競技会"]
["二大学対校陸上競技会（茨大・千大）"]
["群馬大学競技会"]
["関東私学六大学対校陸上競技大会（國学大・上智大・成蹊大・東経大・明学大・立大）"]
["国士舘大学競技会"]
["国士舘大学長距離競技会"]
["国際武道大学競技会"]
["国際武道大学秋季合同競技会"]
["国際武道大学選手権"]
["国際武道大学フィールド競技会"]
["北関東5大学対校陸上競技大会（茨大・宇大・群大・埼大・高経大）"]
["関東私学四大学対校陸上競技大会（上智大、成蹊大、獨協大、明学大）"]
["早大競技会"]
["東京六大学対校陸上競技大会（慶大・東大・法大・明大・立大・早大）"]
["中大競技会"]
["中大長距離競技会"]
["筑波大競技会"]
["筑波大投擲競技会"]
["筑波大ポストシーズン競技会"]
["長距離競技会"]
["13大学対校陸上競技大会（工学院大・首都大・帝京大・電通大・東外大・東工大・東電大・東農工大・東京薬大・東理大・文教大・武蔵工大・横市大）"]
["四大学対校陸上競技大会（国士大・順大・東海大・日女体大・日体大）"]
["関東七大学対校陸上競技大会（学習院大・北里大・成城大・獨協大・東邦大・文教大・明学大）"]
["四大学対校陸上競技大会（学習院大・成蹊大・成城大・武蔵大）"]
["学園スポーツ大会"]
["東海大学競技会"]
["東海大学種目別競技会"]
["国立4大学陸上競技大会（群大・埼大・東大・東学大）"]
["国立4大学女子陸上競技大会（群大・埼大・東大・東学大）"]
["東京大学陸上競技会"]
["八大学対校陸上競技大会(桜美林大、工学院大、成蹊大、成城大、玉川大、東理大、都市大、武蔵大)"]
{"$rows_left_out":85}
{"sheet":"2012","index":6,"n_rows":316,"n_cols":20,"rows_kept":316,"cut":false,"hidden":true,"merged":[]}
[]
[]
[]
[]
[]
[]
[]
[]
[]
[]
[]
[]
[{"$f":"IF(COUNTIF(競技会!$A$2:$J$92,'2012'!I13)=0,\"ないです\",\"\")","v":""},"継続",4,1,"～",4,1,"第21回","群馬大学競技会","103100",{"$f":"IF(VLOOKUP(J13,競技場!$A$2:$B$371,2)=L13,\"○\",\"×\")","v":"○"},"桐生市陸上競技場","関  亜斗利","群馬大学","08012201610","gunnmadai_rikujoubu@hotmail.co.jp",3710044,"前橋市荒牧町173-2-101",null,130401]
[{"$f":"IF(COUNTIF(競技会!$A$2:$J$92,'2012'!I14)=0,\"ないです\",\"\")","v":""},"継続",4,1,"～",4,1,"平成24年度第1回","日本大学競技会","133100",{"$f":"IF(VLOOKUP(J14,競技場!$A$2:$B$371,2)=L14,\"○\",\"×\")","v":"○"},"日本大学陸上競技場","浅野　晃佑","日本大学","0333041969","nihon_univ_tf@yahoo.co.jp",1560045,"東京都世田谷区桜上水３－２３日本大学陸上競技場グランドトレーニング室２F",null,130401]
[{"$f":"IF(COUNTIF(競技会!$A$2:$J$92,'2012'!I15)=0,\"ないです\",\"\")","v":""},"継続",4,1,"～",4,1,"第1回","筑波大競技会","083110",{"$f":"IF(VLOOKUP(J15,競技場!$A$2:$B$371,2)=L15,\"○\",\"×\")","v":"○"},"筑波大学陸上競技場","柳澤　純太","筑波大学","",null,null,null,null,130401]
[{"$f":"IF(COUNTIF(競技会!$A$2:$J$92,'2012'!I16)=0,\"ないです\",\"\")","v":""},"継続",4,1,"～",4,1,"第2回","鹿屋体育大学陸上競技会","463100",{"$f":"IF(VLOOKUP(J16,競技場!$A$2:$B$371,2)=L16,\"○\",\"×\")","v":"○"},"鹿屋体育大学陸上競技場","境　実穂","鹿屋体育大学","0908416632","dada-duck.rn",8912311,"鹿児島県鹿屋市白水町388-1メゾン白水207",null,130401]
[{"$f":"IF(COUNTIF(競技会!$A$2:$J$92,'2012'!I17)=0,\"ないです\",\"\")","v":""},"継続",4,1,"～",4,1,null,"愛知六大学対校陸上競技大会（愛知大・愛知学大・愛教大・名大・南山大・名城大）","222010",{"$f":"IF(VLOOKUP(J17,競技場!$A$2:$B$371,2)=L17,\"○\",\"×\")","v":"○"},"知多運動公園陸上競技場","村松　蒼介","名古屋大学","09017881765","sosuke.protaft@gmail.com",4660807,"愛知県名古屋市昭和区花町93ヒルズ山花303",null,130401]
[{"$f":"IF(COUNTIF(競技会!$A$2:$J$92,'2012'!I18)=0,\"ないです\",\"\")","v":""},"継続",4,1,"～",4,1,null,"梅村学園陸上競技大会","223060",{"$f":"IF(VLOOKUP(J18,競技場!$A$2:$B$371,2)=L18,\"○\",\"×\")","v":"○"},"中京大学梅村陸上競技場","鈴木　雄貴","中京大学","0565461316","chukyot-f@snow.ocn.ne.jp",4700393,"愛知県豊田市貝津町床立101",null,130401]
[{"$f":"IF(COUNTIF(競技会!$A$2:$J$92,'2012'!I19)=0,\"ないです\",\"\")","v":""},"継続",4,7,"～",4,7,"第63回","青山学院大学対東北学院大学陸上競技定期戦","132080",{"$f":"IF(VLOOKUP(J19,競技場!$A$2:$B$371,2)=L19,\"○\",\"×\")","v":"○"},"八王子市上柚木公園陸上競技場","橋本　直也","青山学院大学","08011085457","naoya_akuta0611@yahoo.co.jp",1940021,"東京都町田市中町2-20-20　青山学院大学町田寮",null,130407]
[{"$f":"IF(COUNTIF(競技会!$A$2:$J$92,'2012'!I20)=0,\"ないです\",\"\")","v":""},"継続",4,"7","～",4,"8","第1回","国士舘大学競技会","133160",{"$f":"IF(VLOOKUP(J20,競技場!$A$2:$B$371,2)=L20,\"○\",\"×\")","v":"○"},"国士舘大学多摩陸上競技場","大具　祥子","国士舘大学","08010300138","k_u_a_since1956@hotmail.com",2068515,"東京都多摩市永山7－3－1　国士舘大学陸上競技研究室",null,130407]
[{"$f":"IF(COUNTIF(競技会!$A$2:$J$92,'2012'!I21)=0,\"ないです\",\"\")","v":""},"継続",4,7,"～",4,7,null,"東京女子体育大学土曜競技会","134070",{"$f":"IF(VLOOKUP(J21,競技場!$A$2:$B$371,2)=L21,\"○\",\"×\")","v":"○"},"東京女子体育大学陸上競技場","鈴木　亜季子","東京女子体育大学","07050751478","twcpe.rikujyou@gmail.com",1868668,"東京都国立市富士見台4-30-1",null,130407]
[{"$f":"IF(COUNTIF(競技会!$A$2:$J$92,'2012'!I22)=0,\"ないです\",\"\")","v":""},"継続",4,"7","～",4,"8",null,"国際武道大学競技会","123060",{"$f":"IF(VLOOKUP(J22,競技場!$A$2:$B$371,2)=L22,\"○\",\"×\")","v":"○"},"国際武道大学陸上競技場","三田　萌子","国際武道大学","09042684439","mee_0427-1026_msc@softbank.ne.jp",2995224,"千葉県勝浦市新官996-47橋本ハイツ202",null,130407]
[{"$f":"IF(COUNTIF(競技会!$A$2:$J$92,'2012'!I23)=0,\"ないです\",\"\")","v":""},"継続",4,7,"～",4,7,"第29回","東海大学・日本大学対抗戦",null,{"$f":"IF(VLOOKUP(J23,競技場!$A$2:$B$371,2)=L23,\"○\",\"×\")","v":{"$error":"#N/A"}},"未定","浅野　晃佑","日本大学","0333041969","nihon_univ_tf@yahoo.co.jp",1560045,"東京都世田谷区桜上水３－２３日本大学陸上競技場グランドトレーニング室２F",null,130407]
[{"$f":"IF(COUNTIF(競技会!$A$2:$J$92,'2012'!I24)=0,\"ないです\",\"\")","v":""},"継続",4,7,"～",4,7,"24年度第22回","新四大学対校陸上競技大会（学習院大・成蹊大・東外大・一橋大）","133080",{"$f":"IF(VLOOKUP(J24,競技場!$A$2:$B$371,2)=L24,\"○\",\"×\")","v":"○"},"都立大井ふ頭中央海浜公園陸上競技場","植松　拓也　","成蹊大学","09063402145","ue103063@cc.seikei.ac.jp",null,null,null,130407]
[{"$f":"IF(COUNTIF(競技会!$A$2:$J$92,'2012'!I25)=0,\"ないです\",\"\")","v":""},"継続",4,7,"～",4,7,null,"高知大学春季競技会","393010",{"$f":"IF(VLOOKUP(J25,競技場!$A$2:$B$371,2)=L25,\"○\",\"×\")","v":"○"},"高知大学朝倉地区陸上競技場","穴吹　政人","高知大学","08063979637","kochi_univ2005@yahoo.co.jp",7800945,"高知県高知市本宮町１５９-１-５０２",null,130407]
[{"$f":"IF(COUNTIF(競技会!$A$2:$J$92,'2012'!I26)=0,\"ないです\",\"\")","v":""},"継続",4,7,"～",4,7,"第1回","学連競技会","403120",{"$f":"IF(VLOOKUP(J26,競技場!$A$2:$B$371,2)=L26,\"○\",\"×\")","v":"○"},"福岡大学陸上競技場","末冨　洋一",null,"0927150997","kyu-athi@blue.ocn.ne.jp",8100062,"福岡市中央区荒戸3-3-66 オリエンタル大濠308",null,130407]
[{"$f":"IF(COUNTIF(競技会!$A$2:$J$92,'2012'!I27)=0,\"ないです\",\"\")","v":""},"継続",4,8,"～",4,8,"第38回","定期対校陸上競技大会（中大・日体大）","143050",{"$f":"IF(VLOOKUP(J27,競技場!$A$2:$B$371,2)=L27,\"○\",\"×\")","v":"○"},"日本体育大学健志台陸上競技場","池田　亮","日本体育大学","0459620520","nittai-honbu@d02.itscom.net",2270035,"神奈川県横浜市青葉区すみよし台37－3",null,130408]
[{"$f":"IF(COUNTIF(競技会!$A$2:$J$92,'2012'!I28)=0,\"ないです\",\"\")","v":""},"継続",4,8,"～",4,8,null,"五大学対校陸上競技選手権大会（城西大・上武大・大東大・東洋大・平成国大）",null,{"$f":"IF(VLOOKUP(J28,競技場!$A$2:$B$371,2)=L28,\"○\",\"×\")","v":{"$error":"#N/A"}},"未定","二瓶　大","平成国際大学","08018034424","abc1107yuta@gmail.com",3470001,"埼玉県加須市大越1503",null,130408]
[{"$f":"IF(COUNTIF(競技会!$A$2:$J$92,'2012'!I29)=0,\"ないです\",\"\")","v":""},"継続",4,8,"～",4,8,"第1回","上武大学陸上競技記録会","102030",{"$f":"IF(VLOOKUP(J29,競技場!$A$2:$B$371,2)=L29,\"○\",\"×\")","v":"○"},"伊勢崎市陸上競技場","佐藤　寛将","上武大学","08012205243",null,3728588,"群馬県伊勢崎市戸谷塚町634-1",null,130408]
[{"$f":"IF(COUNTIF(競技会!$A$2:$J$92,'2012'!I30)=0,\"ないです\",\"\")","v":""},"継続",4,8,"～",4,8,"第10回","金沢星稜大学競技会","184050",{"$f":"IF(VLOOKUP(J30,競技場!$A$2:$B$371,2)=L30,\"○\",\"×\")","v":"○"},"学校法人稲置学園総合運動場","杉林　孝法","金沢星稜大学","09049657336","sugi@seiryo-u.ac.jp",9208620,"石川県御所町丑10-1 金沢星稜大学",null,130408]
[{"$f":"IF(COUNTIF(競技会!$A$2:$J$92,'2012'!I31)=0,\"ないです\",\"\")","v":""},"継続",4,8,"～",4,8,"第9回","名桜大学陸上競技会",null,{"$f":"IF(VLOOKUP(J31,競技場!$A$2:$B$371,2)=L31,\"○\",\"×\")","v":{"$error":"#N/A"}},"未定","北村　紀宜","名桜大学","08017839550","daigaku-goukakusuru.kt@docomo.ne.jp",9500005,"沖縄県名護市為又493-13ドミトリー山里Ⅱ3－3Ｂ",null,130408]
[{"$f":"IF(COUNTIF(競技会!$A$2:$J$92,'2012'!I32)=0,\"ないです\",\"\")","v":""},"継続",4,8,"～",4,8,"第1回","大阪体育大学中長距離競技会","273050",{"$f":"IF(VLOOKUP(J32,競技場!$A$2:$B$371,2)=L32,\"○\",\"×\")","v":"○"},"浪商学園陸上競技場","深田　明日美","大阪体育大学","08036249045",null,5900405,"大阪府泉南郡熊取町大久保南4-4-20 ブランドール清原203号",null,130408]
[{"$f":"IF(COUNTIF(競技会!$A$2:$J$92,'2012'!I33)=0,\"ないです\",\"\")","v":""},"継続",4,14,"～",4,14,"24年度第1回","順天堂大学競技会","123080",{"$f":"IF(VLOOKUP(J33,競技場!$A$2:$B$371,2)=L33,\"○\",\"×\")","v":"○"},"順天堂大学さくらキャンパス陸上競技場","白府  将弘","順天堂大学","0476981001","juntendo_kirokukai@yahoo.co.jp",2701695,"千葉県印西市平賀学園台1-1順天堂大学陸上競技研究室",null,130414]
[{"$f":"IF(COUNTIF(競技会!$A$2:$J$92,'2012'!I34)=0,\"ないです\",\"\")","v":""},"継続",4,14,"～",4,14,null,"東京女子体育大学土曜競技会","134070",{"$f":"IF(VLOOKUP(J34,競技場!$A$2:$B$371,2)=L34,\"○\",\"×\")","v":"○"},"東京女子体育大学陸上競技場","鈴木　亜季子","東京女子体育大学","07050751478","twcpe.rikujyou@gmail.com",1868668,"東京都国立市富士見台4-30-1",null,130414]
[{"$f":"IF(COUNTIF(競技会!$A$2:$J$92,'2012'!I35)=0,\"ないです\",\"\")","v":""},"継続",4,"14","～",4,"15","第222回","日本体育大学長距離競技会","143050",{"$f":"IF(VLOOKUP(J35,競技場!$A$2:$B$371,2)=L35,\"○\",\"×\")","v":"○"},"日本体育大学健志台陸上競技場","池田　亮","日本体育大学","0459620520","nittai-honbu@d02.itscom.net",2270035,"神奈川県横浜市青葉区すみよし台37－3",null,130414]
[{"$f":"IF(COUNTIF(競技会!$A$2:$J$92,'2012'!I36)=0,\"ないです\",\"\")","v":""},"継続",4,14,"～",4,14,null,"日本体育大学棒高跳競技会","143050",{"$f":"IF(VLOOKUP(J36,競技場!$A$2:$B$371,2)=L36,\"○\",\"×\")","v":"○"},"日本体育大学健志台陸上競技場","池田　亮","日本体育大学","0459620520","nittai-honbu@d02.itscom.net",2270035,"神奈川県横浜市青葉区すみよし台37－3",null,130414]
[{"$f":"IF(COUNTIF(競技会!$A$2:$J$92,'2012'!I37)=0,\"ないです\",\"\")","v":""},"継続",4,14,"～",4,14,null,"岩壁杯陸上競技対校選手権大会（国武大・城西大・中大・東洋大・法大・平成国大・大東大）","123060",{"$f":"IF(VLOOKUP(J37,競技場!$A$2:$B$371,2)=L37,\"○\",\"×\")","v":"○"},"国際武道大学陸上競技場","三田　萌子","国際武道大学","09042684439","mee_0427-1026_msc@softbank.ne.jp",2995224,"千葉県勝浦市新官996-47橋本ハイツ202",null,130414]
[{"$f":"IF(COUNTIF(競技会!$A$2:$J$92,'2012'!I38)=0,\"ないです\",\"\")","v":""},"継続",4,14,"～",4,14,"第1回","東海大学種目別競技会","143060",{"$f":"IF(VLOOKUP(J38,競技場!$A$2:$B$371,2)=L38,\"○\",\"×\")","v":"○"},"東海大学湘南校舎陸上競技場","菅野　和希","東海大学","08031913712","kazukikanno_13@yahoo.co.jp",2591201,"神奈川県平塚市南金目363-1 青柳荘25号室",null,130414]
[{"$f":"IF(COUNTIF(競技会!$A$2:$J$92,'2012'!I39)=0,\"ないです\",\"\")","v":""},"継続",4,"14","～",4,"15","第2回","筑波大競技会","083110",{"$f":"IF(VLOOKUP(J39,競技場!$A$2:$B$371,2)=L39,\"○\",\"×\")","v":"○"},"筑波大学陸上競技場","柳澤　純太","筑波大学","",null,null,null,null,130414]
[{"$f":"IF(COUNTIF(競技会!$A$2:$J$92,'2012'!I40)=0,\"ないです\",\"\")","v":""},"継続",4,14,"～",4,14,"第1回","流通経済大学陸上競技会","083100",{"$f":"IF(VLOOKUP(J40,競技場!$A$2:$B$371,2)=L40,\"○\",\"×\")","v":"○"},"龍ヶ崎市陸上競技場","田畑　亨","流通経済大学","0297601862","tabata@rku.ac.jp",3018555,"茨城県龍ヶ崎市120",null,130414]
{"$rows_left_out":276}